{"text_format":"1","workbook":"xlsx","n_sheets":6,"sheets":["Tableau de bord","OMFG Week","Cologne 2016","Data","ELEAGUE","Data EL"],"not_rendered":{"charts":0,"images":1,"macros":1,"external_links":0,"defined_names":2,"comments":0,"pivot_tables":0},"unopened":[],"bounds":{"document_bytes":16777216,"sheet_cells":100000,"rows_first":2000,"rows_last":500,"rows_between":2000,"halvings":0,"cell_chars":16384,"cell_head_chars":4096},"cells_cut":0,"cells_raw":0,"read":"whole","date_system":"1900"}

{"sheet":"Tableau de bord","index":0,"n_rows":35,"n_cols":17,"rows_kept":35,"cut":false,"hidden":false,"merged":[[19,14,19,16],[33,1,33,3],[34,1,34,3],[2,1,2,2],[3,1,3,2],[4,1,4,2],[5,1,5,2],[6,1,6,3],[8,1,8,3],[9,1,9,3],[10,1,10,3],[11,1,11,3],[12,1,12,3],[13,1,13,3],[14,1,14,3],[32,1,32,2],[16,1,16,3],[24,1,24,3],[27,1,27,3],[28,1,28,3],[30,1,30,3],[21,1,21,3],[22,1,22,3]]}
[]
[null,null,null,"Résultats","peRf","Cpassimal","douzer","Budo","mikeu","waz","ventur","Nico","doyl"]
[null,"Groupe A",null,"TSM","TSM","NiP","TSM","TSM","TSM","NiP","NiP","TSM","TSM"]
[null,"Groupe B",null,"nV","nV","nV","nV","Kinguin","nV","nV","nV","nV","Flipside"]
[null,"Groupe C",null,"fnatic","fnatic","fnatic","fnatic","fnatic","fnatic","fnatic","fnatic","fnatic","fnatic"]
[null,"Groupe D",null,"VP","C9","VP","VP","C9","C9","C9","VP","VP","C9"]
[null,"Total 1ere phase",null,null,{"$f":"Data!D2+Data!D3+Data!D4+Data!D5","v":15},{"$f":"Data!E2+Data!E3+Data!E4+Data!E5","v":15},{"$f":"Data!F2+Data!F3+Data!F4+Data!F5","v":20},{"$f":"Data!G2+Data!G3+Data!G4+Data!G5","v":10},{"$f":"Data!H2+Data!H3+Data!H4+Data!H5","v":15},{"$f":"Data!I2+Data!I3+Data!I4+Data!I5","v":10},{"$f":"Data!J2+Data!J3+Data!J4+Data!J5","v":15},{"$f":"Data!K2+Data!K3+Data!K4+Data!K5","v":20},{"$f":"Data!L2+Data!L3+Data!L4+Data!L5","v":10}]
[]
[null,"Qualifiés 2ème phase"]
[null,"Kinguin",null,null,"NiP","NaVi","NiP","NiP","Renegades","NaVi","TSM","NiP","CLG"]
[null,"NaVi",null,null,"NaVi","C9","Kinguin","nV","Kinguin","VP","Kinguin","NaVi","nV"]
[null,"NiP",null,null,"VP","Titan","Titan","Titan","NaVi","Titan","NaVi","C9","Titan"]
[null,"Luminosity",null,null,"Kinguin","TSM","C9","mouz","mouz","TSM","C9","mouz","VP"]
[null,"Total 2ème phase",null,null,{"$f":"Data!D6+Data!D7+Data!D8+Data!D9","v":9},{"$f":"Data!E6+Data!E7+Data!E8+Data!E9","v":3},{"$f":"Data!F6+Data!F7+Data!F8+Data!F9","v":6},{"$f":"Data!G6+Data!G7+Data!G8+Data!G9","v":3},{"$f":"Data!H6+Data!H7+Data!H8+Data!H9","v":6},{"$f":"Data!I6+Data!I7+Data!I8+Data!I9","v":3},{"$f":"Data!J6+Data!J7+Data!J8+Data!J9","v":6},{"$f":"Data!K6+Data!K7+Data!K8+Data!K9","v":6},{"$f":"Data!L6+Data!L7+Data!L8+Data!L9","v":0}]
[null,"Total phases de poules",null,null,{"$f":"E7+E14","v":24},{"$f":"F7+F14","v":18},26,13,21,13,21,26,{"$f":"M7+M14","v":10}]
[]
[null,"Quarts de finales"]
[null,"nV","NaVi","2 - 0","2 - 1","2 - 1","2 - 0","2 - 1","2 - 0","1 - 2","2 - 0","2 - 1","2 - 1"]
[null,"TSM","Kinguin","2 - 0","2 - 0","2 - 1","2 - 1","2 - 0","2 - 1","0 - 2","2 - 1","2 - 0","0 - 2"]
[null,"VP","NiP","2 - 0","1 - 2","0 - 2","2 - 1","1 - 2","1 - 2","0 - 2","1 - 2","2 - 1","2 - 0",null,"classement"]
[null,"fnatic","Luminosity","2 - 0","2 - 0","2 - 0","2 - 0","2 - 0","2 - 1","2 - 0","2 - 0","2 - 0","2 - 0",null,"1er",{"$f":"Data!N2","v":"douzer"},{"$f":"Data!O2 &\" pts\"","v":"52 pts"}]
[null,"total 1/4 de finales",null,null,{"$f":"Data!D10+Data!D11+Data!D12+Data!D13","v":21},{"$f":"Data!E10+Data!E11+Data!E12+Data!E13","v":18},{"$f":"Data!F10+Data!F11+Data!F12+Data!F13","v":26},{"$f":"Data!G10+Data!G11+Data!G12+Data!G13","v":21},{"$f":"Data!H10+Data!H11+Data!H12+Data!H13","v":18},{"$f":"Data!I10+Data!I11+Data!I12+Data!I13","v":8},{"$f":"Data!J10+Data!J11+Data!J12+Data!J13","v":21},{"$f":"Data!K10+Data!K11+Data!K12+Data!K13","v":26},{"$f":"Data!L10+Data!L11+Data!L12+Data!L13","v":21},null,{"$f":"IF(Q22=Q21,\"-\",\"2eme\")","v":"-"},{"$f":"Data!N3","v":"Nico"},{"$f":"Data!O3 &\" pts\"","v":"52 pts"}]
[null,"total provisoire",null,null,{"$f":"E15+E22","v":45},{"$f":"F15+F22","v":36},52,34,39,21,42,52,{"$f":"M15+M22","v":31},null,{"$f":"IF(Q23=Q22,\"-\",\"3eme\")","v":"3eme"},{"$f":"Data!N4","v":"peRf"},{"$f":"Data!O4 &\" pts\"","v":"60 pts"}]
[null,null,null,null,null,null,null,null,null,null,null,null,null,null,{"$f":"IF(Q24=Q23,\"-\",\"4eme\")","v":"4eme"},{"$f":"Data!N5","v":"Cpassimal"},{"$f":"Data!O5 &\" pts\"","v":"36 pts"}]
[null,"demies finales",null,null,null,null,null,null,null,null,null,null,null,null,{"$f":"IF(Q25=Q24,\"-\",\"5eme\")","v":"5eme"},{"$f":"Data!N6","v":"ventur"},{"$f":"Data!O6 &\" pts\"","v":"42 pts"}]
[null,"nV","TSM",null,"2 - 0","0 - 0","1 - 2","2 - 1","1 - 2","0 - 0","1 - 2","0 - 0","2 - 1",null,{"$f":"IF(Q26=Q25,\"-\",\"6eme\")","v":"6eme"},{"$f":"Data!N7","v":"mikeu"},{"$f":"Data!O7 &\" pts\"","v":"39 pts"}]
[null,"VP","fnatic",null,"2 - 1","0 - 0","1 - 2","0 - 2","0 - 2","0 - 0","0 - 2","0 - 0","1 - 2",null,{"$f":"IF(Q27=Q26,\"-\",\"7eme\")","v":"7eme"},{"$f":"Data!N8","v":"Budo"},{"$f":"Data!O8 &\" pts\"","v":"34 pts"}]
[null,"total 1/2 finale",null,null,{"$f":"Data!D14+Data!D15","v":0},{"$f":"Data!E14+Data!E15","v":0},{"$f":"Data!F14+Data!F15","v":0},{"$f":"Data!G14+Data!G15","v":0},{"$f":"Data!H14+Data!H15","v":0},{"$f":"Data!I14+Data!I15","v":0},{"$f":"Data!J14+Data!J15","v":0},{"$f":"Data!K14+Data!K15","v":0},{"$f":"Data!L14+Data!L15","v":0},null,{"$f":"IF(Q28=Q27,\"-\",\"8eme\")","v":"8eme"},{"$f":"Data!N9","v":"doyl"},{"$f":"Data!O9 &\" pts\"","v":"31 pts"}]
[null,"total provisoire",null,null,{"$f":"E23+E28","v":45},{"$f":"F23+F28","v":36},52,34,39,21,42,52,{"$f":"M23+M28","v":31},null,{"$f":"IF(Q29=Q28,\"-\",\"9eme\")","v":"9eme"},{"$f":"Data!N10","v":"waz"},{"$f":"Data!O10 &\" pts\"","v":"21 pts"}]
[null,null,null,null,null,null,null,null,null,null,null,null,null,null,"10ème",{"$f":"Data!N11","v":0},{"$f":"Data!O11 &\" pts\"","v":" pts"}]
[null,"finale",null,null,null,null,null,null,null,null,null,null,null,null,"11ème",{"$f":"Data!N12","v":0},{"$f":"Data!O12 &\" pts\"","v":" pts"}]
[null,null,null,"0 - 0","0 - 0"]
[null,"topfragger",null,"x"]
[null,"total finale",null,null,{"$f":"Data!D16+Data!D17","v":15},{"$f":"Data!E16+Data!E17","v":0},{"$f":"Data!F16+Data!F17","v":0},{"$f":"Data!G16+Data!G17","v":0},{"$f":"Data!H16+Data!H17","v":0},{"$f":"Data!I16+Data!I17","v":0},{"$f":"Data!J16+Data!J17","v":0},{"$f":"Data!K16+Data!K17","v":0},{"$f":"Data!L16+Data!L17","v":0}]
[null,"total",null,null,{"$f":"E29+E34","v":60},{"$f":"F29+F34","v":36},52,34,39,21,42,52,{"$f":"M29+M34","v":31}]

{"sheet":"OMFG Week","index":1,"n_rows":33,"n_cols":18,"rows_kept":33,"cut":false,"hidden":false,"merged":[[3,15,3,17]]}
[]
[]
[null,null,"gagnes","perdus","coef","ratio","total","Joues"]
[null,"peRf",{"$f":"K4+K5+K6+K9+K11+L14+K20+K27","v":411},{"$f":"L4+L5+L6+L9+L11+K14+L20+L27","v":418},1.7,{"$f":"IFERROR(C4/(C4+D4),\"\")","v":0.49577804583835949},{"$f":"(C4*3+D4*1)*E4","v":2806.7},{"$f":"C4+D4","v":829},null,"perf",87,117,"neo",{"$f":"K4+L4","v":204},null,"classement"]
[null,"neo",{"$f":"L4+K12+K18+L19+K21+K22+K30","v":582},{"$f":"K4+L12+L18+K19+L21+L22+L30","v":365},1.6,{"$f":"IFERROR(C5/(C5+D5),\"\")","v":0.61457233368532205},{"$f":"(C5*3+D5*1)*E5","v":3377.6000000000004},{"$f":"C5+D5","v":947},null,"perf",29,48,"douz",{"$f":"K5+L5","v":77},null,"1er",{"$f":"Data!Q2","v":"neo"},{"$f":"Data!R2","v":3377.6000000000004}]
[null,"douzer",{"$f":"L5+L7+L13+K16+L18+K23+K24+K25+L28","v":315},{"$f":"K5+K7+K13+L16+K18+L23+L24+L25+K28","v":202},1.8,0.60928433268858806,{"$f":"(C6*3+D6*1)*E6","v":2064.6},517,null,"perf",31,48,"pat",79,null,{"$f":"IF(R6=R5,\"-\",\"2eme\")","v":"2eme"},{"$f":"Data!Q3","v":"peRf"},{"$f":"Data!R3","v":2806.7}]
[null,"pat",{"$f":"L6+K7+L8","v":67},{"$f":"K6+L7+K8","v":63},1.2,0.51538461538461533,{"$f":"(C7*3+D7*1)*E7","v":316.8},130,null,"pat",7,16,"douz",23,null,{"$f":"IF(R7=R6,\"-\",\"3eme\")","v":"3eme"},{"$f":"Data!Q4","v":"douzer"},{"$f":"Data!R4","v":2064.6}]
[null,"ventur",{"$f":"K8+L9+K10+K19+K28+K29","v":226},{"$f":"L8+K9+L10+L19+L28+L29","v":166},1.5,0.57653061224489799,1266,392,null,"ventur",16,12,"pat",28,null,{"$f":"IF(R8=R7,\"-\",\"4eme\")","v":"4eme"},{"$f":"Data!Q5","v":"kid"},{"$f":"Data!R5","v":1276.8}]
[null,"kid",{"$f":"L10+L11+L12+L24+K26","v":214},{"$f":"K10+K11+K12+K24+L26","v":270},1.4,0.44214876033057854,1276.8,484,null,"perf",45,80,"ventur",125,null,{"$f":"IF(R9=R8,\"-\",\"5eme\")","v":"5eme"},{"$f":"Data!Q6","v":"ventur"},{"$f":"Data!R6","v":1266}]
[null,"epicier",{"$f":"K13+K14+K15+L22","v":74},{"$f":"L13+L14+L15+K22","v":182},1.3,0.2890625,525.20000000000005,256,null,"ventur",32,16,"kid",48,null,{"$f":"IF(R10=R9,\"-\",\"6eme\")","v":"6eme"},{"$f":"Data!Q7","v":"cpassimal"},{"$f":"Data!R7","v":702.90000000000009}]
[null,"quentin",{"$f":"L15+L16+L17","v":17},{"$f":"K15+K16+K17","v":48},1.2,0.26153846153846155,118.8,65,null,"perf",60,40,"kid",100,null,{"$f":"IF(R11=R10,\"-\",\"7eme\")","v":"7eme"},{"$f":"Data!Q8","v":"epicier"},{"$f":"Data!R8","v":525.20000000000005}]
[null,"doyl",{"$f":"K17+L23+L27+L29+L30","v":75},{"$f":"L17+K23+K27+K29+K30","v":100},1.4,0.42857142857142855,454.99999999999994,175,null,"neo",123,94,"kid",217,null,{"$f":"IF(R12=R11,\"-\",\"8eme\")","v":"8eme"},{"$f":"Data!Q9","v":"doyl"},{"$f":"Data!R9","v":454.99999999999994}]
[null,"cpassimal",{"$f":"L20+L21","v":128},{"$f":"K20+K21","v":255},1.1000000000000001,0.33420365535248042,702.90000000000009,383,null,"epicier",16,48,"douzer",64,null,{"$f":"IF(R13=R12,\"-\",\"9eme\")","v":"9eme"},{"$f":"Data!Q10","v":"pat"},{"$f":"Data!R10","v":316.8}]
[null,"axwell",{"$f":"L25+L26","v":8},{"$f":"K25+K26","v":48},1.1000000000000001,0.14285714285714285,79.2,56,null,"epicier",16,32,"perf",48,null,{"$f":"IF(R14=R13,\"-\",\"10eme\")","v":"10eme"},{"$f":"Data!Q11","v":"quentin"},{"$f":"Data!R11","v":118.8}]
[null,null,null,null,null,"",0,0,null,"epicier",16,6,"quentin",22,null,{"$f":"IF(R15=R14,\"-\",\"11eme\")","v":"11eme"},{"$f":"Data!Q12","v":"axwell"},{"$f":"Data!R12","v":79.2}]
[null,null,null,null,null,"",0,0,null,"douzer",16,7,"quentin",23]
[null,null,null,null,null,"",0,0,null,"doyl",16,4,"quentin",20]
[null,null,null,null,null,"",0,0,null,"neo",33,47,"douzer",80]
[null,null,null,null,null,"",0,0,null,"ventur",34,53,"neo",87]
[null,null,null,null,null,"",0,0,null,"perf",111,61,"cpassimal",172]
[null,null,null,null,null,"",0,0,null,"neo",144,67,"cpassimal",211]
[null,null,null,null,null,"",0,0,null,"neo",96,26,"epicier",122]
[null,null,null,null,null,"",0,0,null,"douzer",48,29,"doyl",77]
[null,null,{"$f":"SUM(C4:C23)","v":2117},{"$f":"SUM(D4:D23)","v":2117},null,null,null,null,null,"douzer",48,32,"kid",80]
[null,null,null,null,null,null,null,null,null,"douzer",16,1,"axwell",17]
[null,null,null,null,null,null,null,null,null,"kid",32,7,"axwell",39]
[null,null,null,null,null,null,null,null,null,"perf",16,8,"doyl",24]
[null,null,null,null,null,null,null,null,null,"ventur",48,28,"douzer",76]
[null,null,null,null,null,null,null,null,null,"ventur",16,12,"doyl",28]
[null,null,null,null,null,null,null,null,null,"Neo",16,10,"doyl",26]
[null,null,null,null,null,null,null,null,null,null,null,null,null,0]
[null,null,null,null,null,null,null,null,null,null,null,null,null,0]
[null,null,null,null,null,null,null,null,null,null,null,null,null,0]

{"sheet":"Cologne 2016","index":2,"n_rows":57,"n_cols":24,"rows_kept":57,"cut":false,"hidden":false,"merged":[[1,21,1,23],[45,2,45,4],[50,2,50,4],[49,2,49,3],[51,2,51,4],[52,2,52,4],[1,2,1,4],[27,2,27,4],[32,2,32,4],[33,2,33,4],[35,2,35,4],[42,2,42,4],[43,2,43,4],[25,2,25,4],[47,2,47,3],[48,2,48,3],[38,2,38,3],[39,2,39,3],[40,2,40,3],[41,2,41,3]]}
[]
[null,null,"Poules",null,null,"DOYL","EPICIER","DARKS","KEVNAY","NICO","BUDO","VENTUR","MIKEU","CPASSIMAL","DOUZER","PERF",null,null,null,null,null,"classement"]
[null,"Groupe A","Astralis","dignitas","Astralis","ASTRALIS","ASTRALIS","ASTRALIS","ASTRALIS","ASTRALIS","ASTRALIS","ASTRALIS","ASTRALIS","ASTRALIS","ASTRALIS","ASTRALIS",null,null,null,null,null,"1er",{"$f":"Data!T2","v":"DOUZER"},{"$f":"Data!U2 &\" pts\"","v":"92 pts"}]
[null,null,"CLG","Gambit","Gambit","GAMBIT","CLG","CLG","CLG","CLG","CLG","CLG","GAMBIT","GAMBIT","GAMBIT","CLG",null,null,null,null,null,{"$f":"IF(X3=X4,\"-\",\"2eme\")","v":"2eme"},{"$f":"Data!T3","v":"MIKEU"},{"$f":"Data!U3 &\" pts\"","v":"84 pts"}]
[null,"Winners",{"$f":"IF(ISBLANK(E3),\"\",E3)","v":"Astralis"},{"$f":"IF(ISBLANK(E4),\"\",E4)","v":"Gambit"},"Gambit","ASTRALIS","astralis","astralis","astralis","astralis","astralis","astralis","ASTRALIS","astralis","astralis","astralis",null,null,null,null,null,{"$f":"IF(X5=X4,\"-\",\"3eme\")","v":"3eme"},{"$f":"Data!T4","v":"KEVNAY"},{"$f":"Data!U4 &\" pts\"","v":"83 pts"}]
[null,"Looser",{"$f":"IF(ISBLANK(E3),\"\",IF(C3=C5,D3,C3))","v":"dignitas"},{"$f":"IF(ISBLANK(E4),\"\",IF(D4=D5,C4,D4))","v":"CLG"},"dignitas","dignitas","clg","clg","dignitas","clg","dignitas","dignitas","dignitas","clg","dignitas","dignitas",null,null,null,null,null,{"$f":"IF(X6=X5,\"-\",\"4eme\")","v":"-"},{"$f":"Data!T5","v":"CPASSIMAL"},{"$f":"Data!U5 &\" pts\"","v":"83 pts"}]
[null,"Decider",{"$f":"IF(ISBLANK(E5),\"\",IF(C5=E5,D5,C5))","v":"Astralis"},{"$f":"IF(ISBLANK(E6),\"\",E6)","v":"dignitas"},"2 - 1","2 - 1",null,"2 - 1","2 - 1","2 - 1",null,"2 - 0","2 - 0","2 - 1","0 - 2","1 - 2",null,null,null,null,null,{"$f":"IF(X7=X6,\"-\",\"5eme\")","v":"5eme"},{"$f":"Data!T6","v":"VENTUR"},{"$f":"Data!U6 &\" pts\"","v":"81 pts"}]
[null,"Groupe B","NaVi","F3","NaVi","NAVI","FLIPSIDE","NAVI","NAVI","NAVI","NAVI","NAVI","NAVI","NAVI","NAVI","NAVI",null,null,null,null,null,{"$f":"IF(X8=X7,\"-\",\"6eme\")","v":"6eme"},{"$f":"Data!T7","v":"NICO"},{"$f":"Data!U7 &\" pts\"","v":"69 pts"}]
[null,null,"NiP","OpTic","NiP","NIP","NIP","OPTIC","NIP","NIP","NIP","NIP","NIP","NIP","NIP","NIP",null,null,null,null,null,{"$f":"IF(X9=X8,\"-\",\"7eme\")","v":"7eme"},{"$f":"Data!T8","v":"PERF"},{"$f":"Data!U8 &\" pts\"","v":"65 pts"}]
[null,"Winners",{"$f":"IF(ISBLANK(E8),\"\",E8)","v":"NaVi"},{"$f":"IF(ISBLANK(E9),\"\",E9)","v":"NiP"},"NaVi","nip","navi","navi","navi","nip","nip","nip","nip","navi","navi","navi",null,null,null,null,null,{"$f":"IF(X10=X9,\"-\",\"8eme\")","v":"8eme"},{"$f":"Data!T9","v":"DOYL"},{"$f":"Data!U9 &\" pts\"","v":"58 pts"}]
[null,"Looser","flipside",{"$f":"IF(ISBLANK(E9),\"\",IF(D9=D10,C9,D9))","v":"OpTic"},"flipside","flipside","flipside","optic","flipside","optic","optic","optic","flipside","flipside","flipside","flipside",null,null,null,null,null,{"$f":"IF(X11=X10,\"-\",\"9eme\")","v":"9eme"},{"$f":"Data!T10","v":"DARKS"},{"$f":"Data!U10 &\" pts\"","v":"49 pts"}]
[null,"Decider",{"$f":"IF(ISBLANK(E10),\"\",IF(C10=E10,D10,C10))","v":"NiP"},{"$f":"IF(ISBLANK(E11),\"\",E11)","v":"flipside"},"1 - 2","2 - 0",null,"2 - 0","2 - 1","2 - 0",null,"2 - 0","2 - 0","2 - 0","2 - 0","2 - 0",null,null,null,null,null,{"$f":"IF(X12=X11,\"-\",\"10eme\")","v":"10eme"},{"$f":"Data!T11","v":"BUDO"},{"$f":"Data!U11 &\" pts\"","v":"38 pts"}]
[null,"Groupe C","Liquid","nV","Liquid","LIQUID","NV","NV","LIQUID","NV","LIQUID","LIQUID","LIQUID","LIQUID","NV","LIQUID",null,null,null,null,null,{"$f":"IF(X13=X12,\"-\",\"11eme\")","v":"11eme"},{"$f":"Data!T12","v":"EPICIER"},{"$f":"Data!U12 &\" pts\"","v":"18 pts"}]
[null,null,"VP","mouz","VP","VP","MOUZ","VP","MOUZ","MOUZ","MOUZ","MOUZ","VP","VP","VP","MOUZ",null,null,null,null,null,{"$f":"IF(X14=X13,\"-\",\"12eme\")","v":"12eme"},{"$f":"Data!T13","v":0},{"$f":"Data!U13 &\" pts\"","v":" pts"}]
[null,"Winners",{"$f":"IF(ISBLANK(E13),\"\",E13)","v":"Liquid"},{"$f":"IF(ISBLANK(E14),\"\",E14)","v":"VP"},"VP","vp","liquid","liquid","liquid","vp","liquid","liquid","liquid","liquid","vp","liquid",null,null,null,null,null,{"$f":"IF(X15=X14,\"-\",\"13eme\")","v":"-"},{"$f":"Data!T14","v":0},{"$f":"Data!U14 &\" pts\"","v":" pts"}]
[null,"Looser",{"$f":"IF(ISBLANK(E13),\"\",IF(C13=C15,D13,C13))","v":"nV"},{"$f":"IF(ISBLANK(E14),\"\",IF(D14=D15,C14,D14))","v":"mouz"},"mouz","mouz","mouz","mouz","mouz","nv","mouz","mouz","mouz","mouz","mouz","mouz",null,null,null,null,null,{"$f":"IF(X16=X15,\"-\",\"14eme\")","v":"-"},{"$f":"Data!T15","v":0},{"$f":"Data!U15 &\" pts\"","v":" pts"}]
[null,"Decider",{"$f":"IF(ISBLANK(E15),\"\",IF(C15=E15,D15,C15))","v":"Liquid"},{"$f":"IF(ISBLANK(E16),\"\",E16)","v":"mouz"},"2 - 0","2 - 0",null,"2 - 1","2 - 1","0 - 2",null,"2 - 1","2 - 1","1 - 2","2 - 1","2 - 1"]
[null,"Groupe D","LG","G2","LG","G2","G2","G2","LG","LG","LG","LG","G2","G2","LG","G2"]
[null,null,"fnatic","FaZe","FaZe","FNATIC","FNATIC","FAZE","FNATIC","FNATIC","FNATIC","FNATIC","FNATIC","FNATIC","FNATIC","FNATIC"]
[null,"Winners",{"$f":"IF(ISBLANK(E18),\"\",E18)","v":"LG"},{"$f":"IF(ISBLANK(E19),\"\",E19)","v":"FaZe"},"LG","faze","lg","faze","lg","lg","lg","lg","lg","lg","lg","faze"]
[null,"Looser",{"$f":"IF(ISBLANK(E18),\"\",IF(C18=C20,D18,C18))","v":"G2"},{"$f":"IF(ISBLANK(E19),\"\",IF(D19=D20,C19,D19))","v":"fnatic"},"fnatic","fnatic","g2","fnatic","g2","fnatic","fnatic","fnatic","fnatic","fnatic","g2","g2"]
[null,"Decider",{"$f":"IF(ISBLANK(E20),\"\",IF(C20=E20,D20,C20))","v":"FaZe"},{"$f":"IF(ISBLANK(E21),\"\",E21)","v":"fnatic"},"0 - 2","2 - 1",null,"1 - 2","0 - 2","1 - 2",null,"1 - 2","2 - 1","1 - 2","1 - 2","2 - 1"]
[null,"PRONO BONUS","1ER JOUR","COTE CSGL","LIQUID-NV","LIQUID-NV","VP-MOUZ","NIP-OPTIC","LIQUID-NV","LG-G2","LG-G2","LIQUID-NV","LIQUID-NV","VP-MOUZ","LG-G2","FAZE-FNATIC"]
[null,null,"2EME JOUR","rape","dignitas-clg","g2-fnatic","nv-mouz","navi-nip","dignitas-clg","astralis-gambit","astralis-gambit","astralis-gambit","astralis-gambit","nv-mouz","nv-mouz","nv-mouz"]
[null,null,"3EME JOUR","retard",5,7,null,8,19,11,null,10,11,5,12,11]
[null,null,"TOTAL POULES",null,null,{"$f":"Data!D44","v":46},{"$f":"Data!E44","v":18},{"$f":"Data!F44","v":33},{"$f":"Data!G44","v":45},{"$f":"Data!H44","v":29},{"$f":"Data!I44","v":27},{"$f":"Data!J44","v":40},{"$f":"Data!K44","v":42},{"$f":"Data!L44","v":45},{"$f":"Data!M44","v":43},{"$f":"Data!N44","v":28},{"$f":"Data!O44","v":0},{"$f":"Data!P44","v":0},{"$f":"Data!Q44","v":0},{"$f":"Data!R44","v":0}]
[]
[null,null,"Quarts de finales"]
[null,null,{"$f":"IF(Data!A50=TRUE,\"\",'Cologne 2016'!E5)","v":"Gambit"},"fnatic","0 - 2","2 - 0",null,"1 - 2","0 - 2","0 - 2",null,"0 - 2","1 - 2","0 - 2","0 - 2","0 - 2"]
[null,null,{"$f":"IF(Data!A51=TRUE,\"\",'Cologne 2016'!E10)","v":"NaVi"},"Liquid","1 - 2","1 - 2",null,"2 - 1","2 - 1","2 - 1",null,"2 - 1","1 - 2","2 - 1","2 - 0","2 - 1"]
[null,null,{"$f":"IF(Data!A52=TRUE,\"\",'Cologne 2016'!E15)","v":"VP"},"Astralis","2 - 0","0 - 2",null,"1 - 2","2 - 1","2 - 1",null,"2 - 1","1 - 2","1 - 2","2 - 1","2 - 0"]
[null,null,{"$f":"IF(Data!A53=TRUE,\"\",'Cologne 2016'!E20)","v":"LG"},"Flipside","2 - 0","1 - 2",null,"2 - 0","2 - 0","2 - 0",null,"2 - 0","2 - 0","2 - 0","2 - 0","2 - 0"]
[null,null,"total 1/4 de finales",null,null,{"$f":"SUM(Data!D45:D48)+SUM(Data!D55:D55)","v":10},{"$f":"SUM(Data!E45:E48)+SUM(Data!E55:E55)","v":0},{"$f":"SUM(Data!F45:F48)+SUM(Data!F55:F55)","v":10},{"$f":"SUM(Data!G45:G48)+SUM(Data!G55:G55)","v":20},{"$f":"SUM(Data!H45:H48)+SUM(Data!H55:H55)","v":20},{"$f":"SUM(Data!I45:I48)+SUM(Data!I55:I55)","v":0},{"$f":"SUM(Data!J45:J48)+SUM(Data!J55:J55)","v":18},{"$f":"SUM(Data!K45:K48)+SUM(Data!K55:K55)","v":18},{"$f":"SUM(Data!L45:L48)+SUM(Data!L55:L55)","v":14},{"$f":"SUM(Data!M45:M48)+SUM(Data!M55:M55)","v":20},{"$f":"SUM(Data!N45:N48)+SUM(Data!N55:N55)","v":24},{"$f":"SUM(Data!O45:O48)+SUM(Data!O55:O55)","v":0},{"$f":"SUM(Data!P45:P48)+SUM(Data!P55:P55)","v":0},{"$f":"SUM(Data!Q45:Q48)+SUM(Data!Q55:Q55)","v":0},{"$f":"SUM(Data!R45:R48)+SUM(Data!R55:R55)","v":0}]
[null,null,"total provisoire",null,null,{"$f":"F26+F33","v":56},{"$f":"G26+G33","v":18},43,65,49,27,58,60,59,63,52,0,0,0,0]
[]
[null,null,"demies finales"]
[null,null,"VP","LG","1 - 2","2 - 1",null,null,"0 - 2","0 - 2",null,"0 - 2","1 - 2","1 - 2","1 - 2","0 - 2"]
[null,null,"Liquid","fnatic","2 - 0","0 - 2",null,null,"0 - 2","0 - 2",null,"1 - 2","1 - 2","1 - 2","0 - 2","1 - 2"]
[null,null,"vp",null,"overpass","cache",null,"mirages","dust2","overpass",null,"dust2","dust2","dust2","dust2","dust2"]
[null,null,"lg",null,"cache","cbble",null,"dust2","cache","cache",null,"cache","cache","cache","cache","cache"]
[null,null,"Liquid",null,"overpass","cache",null,"overpass","cache","dust2",null,"nuke","overpass","overpass","overpass","overpass"]
[null,null,"fnatic",null,"nuke","dust2",null,"nuke","nuke","nuke",null,"nuke","nuke","nuke","nuke","nuke"]
[null,null,"total 1/2 finale",null,null,{"$f":"SUM(Data!D49:D50)+Data!D56","v":0},{"$f":"SUM(Data!E49:E50)+Data!E56","v":0},{"$f":"SUM(Data!F49:F50)+Data!F56","v":4},{"$f":"SUM(Data!G49:G50)+Data!G56","v":9},{"$f":"SUM(Data!H49:H50)+Data!H56","v":11},{"$f":"SUM(Data!I49:I50)+Data!I56","v":0},{"$f":"SUM(Data!J49:J50)+Data!J56","v":9},{"$f":"SUM(Data!K49:K50)+Data!K56","v":13},{"$f":"SUM(Data!L49:L50)+Data!L56","v":13},{"$f":"SUM(Data!M49:M50)+Data!M56","v":13},{"$f":"SUM(Data!N49:N50)+Data!N56","v":11},{"$f":"SUM(Data!O49:O50)+Data!O56","v":0},{"$f":"SUM(Data!P49:P50)+Data!P56","v":0},{"$f":"SUM(Data!Q49:Q50)+Data!Q56","v":0},{"$f":"SUM(Data!R49:R50)+Data!R56","v":0}]
[null,null,"total provisoire",null,null,{"$f":"F34+F43","v":56},{"$f":"G34+G43","v":18},47,74,60,27,67,73,72,76,63,0,0,0,{"$f":"T34+T43","v":0}]
[]
[null,null,"finale"]
[null,null,"lg","liquid","2 - 0","0 - 2",null,"1 - 2","2 - 1","2 - 1","2 - 1","2 - 0","2 - 1","2 - 1","2 - 0","1 - 2"]
[null,null,"topfragger",null,"cold","simple",null,"simple","cold","cold","cold","cold","cold","cold","cold","simple"]
[null,null,2,null,"taco","hiko",null,"fallen","simple","simple","simple","fallen","fallen","fnx","taco","cold"]
[null,null,3,null,"fallen/fnx","cold",null,"hiko","fer","fer","fallen","jdm","simple","simple","fallen","hiko"]
[null,null,"bonus top fragger",null,null,{"$f":"F55+F56+F57","v":2},{"$f":"G55+G56+G57","v":0},2,3,3,5,5,5,5,7,2,0,0,0,0]
[null,null,"total finale",null,null,{"$f":"SUM(Data!D51:D52)+F51","v":2},{"$f":"SUM(Data!E51:E52)+G51","v":0},{"$f":"SUM(Data!F51:F52)+H51","v":2},{"$f":"SUM(Data!G51:G52)+I51","v":9},{"$f":"SUM(Data!H51:H52)+J51","v":9},{"$f":"SUM(Data!I51:I52)+K51","v":11},{"$f":"SUM(Data!J51:J52)+L51","v":14},{"$f":"SUM(Data!K51:K52)+M51","v":11},{"$f":"SUM(Data!L51:L52)+N51","v":11},{"$f":"SUM(Data!M51:M52)+O51","v":16},{"$f":"SUM(Data!N51:N52)+P51","v":2},{"$f":"SUM(Data!O51:O52)","v":0},{"$f":"SUM(Data!P51:P52)","v":0},{"$f":"SUM(Data!Q51:Q52)","v":0},{"$f":"SUM(Data!R51:R52)","v":0}]
[null,null,"total",null,null,{"$f":"F26+F33+F43+F52","v":58},{"$f":"G26+G33+G43+G52","v":18},49,83,69,38,81,84,83,92,65,0,0,0,0]
[]
[null,null,null,null,null,{"$f":"IF('Cologne 2016'!$E$48='Cologne 2016'!F48,3,IF(OR('Cologne 2016'!$E$48='Cologne 2016'!F49,'Cologne 2016'!$E$48='Cologne 2016'!F50),2,0))","v":2},{"$f":"IF('Cologne 2016'!$E$48='Cologne 2016'!G48,3,IF(OR('Cologne 2016'!$E$48='Cologne 2016'!G49,'Cologne 2016'!$E$48='Cologne 2016'!G50),2,0))","v":0},{"$f":"IF('Cologne 2016'!$E$48='Cologne 2016'!H48,3,IF(OR('Cologne 2016'!$E$48='Cologne 2016'!H49,'Cologne 2016'!$E$48='Cologne 2016'!H50),2,0))","v":0},{"$f":"IF('Cologne 2016'!$E$48='Cologne 2016'!I48,3,IF(OR('Cologne 2016'!$E$48='Cologne 2016'!I49,'Cologne 2016'!$E$48='Cologne 2016'!I50),2,0))","v":3},{"$f":"IF('Cologne 2016'!$E$48='Cologne 2016'!J48,3,IF(OR('Cologne 2016'!$E$48='Cologne 2016'!J49,'Cologne 2016'!$E$48='Cologne 2016'!J50),2,0))","v":3},{"$f":"IF('Cologne 2016'!$E$48='Cologne 2016'!K48,3,IF(OR('Cologne 2016'!$E$48='Cologne 2016'!K49,'Cologne 2016'!$E$48='Cologne 2016'!K50),2,0))","v":3},{"$f":"IF('Cologne 2016'!$E$48='Cologne 2016'!L48,3,IF(OR('Cologne 2016'!$E$48='Cologne 2016'!L49,'Cologne 2016'!$E$48='Cologne 2016'!L50),2,0))","v":3},{"$f":"IF('Cologne 2016'!$E$48='Cologne 2016'!M48,3,IF(OR('Cologne 2016'!$E$48='Cologne 2016'!M49,'Cologne 2016'!$E$48='Cologne 2016'!M50),2,0))","v":3},{"$f":"IF('Cologne 2016'!$E$48='Cologne 2016'!N48,3,IF(OR('Cologne 2016'!$E$48='Cologne 2016'!N49,'Cologne 2016'!$E$48='Cologne 2016'!N50),2,0))","v":3},{"$f":"IF('Cologne 2016'!$E$48='Cologne 2016'!O48,3,IF(OR('Cologne 2016'!$E$48='Cologne 2016'!O49,'Cologne 2016'!$E$48='Cologne 2016'!O50),2,0))","v":3},{"$f":"IF('Cologne 2016'!$E$48='Cologne 2016'!P48,3,IF(OR('Cologne 2016'!$E$48='Cologne 2016'!P49,'Cologne 2016'!$E$48='Cologne 2016'!P50),2,0))","v":2},{"$f":"IF('Cologne 2016'!$E$48='Cologne 2016'!Q48,3,IF(OR('Cologne 2016'!$E$48='Cologne 2016'!Q49,'Cologne 2016'!$E$48='Cologne 2016'!Q50),2,0))","v":0},{"$f":"IF('Cologne 2016'!$E$48='Cologne 2016'!R48,3,IF(OR('Cologne 2016'!$E$48='Cologne 2016'!R49,'Cologne 2016'!$E$48='Cologne 2016'!R50),2,0))","v":0},{"$f":"IF('Cologne 2016'!$E$48='Cologne 2016'!S48,3,IF(OR('Cologne 2016'!$E$48='Cologne 2016'!S49,'Cologne 2016'!$E$48='Cologne 2016'!S50),2,0))","v":0},{"$f":"IF('Cologne 2016'!$E$48='Cologne 2016'!T48,3,IF(OR('Cologne 2016'!$E$48='Cologne 2016'!T49,'Cologne 2016'!$E$48='Cologne 2016'!T50),2,0))","v":0}]
[null,null,null,null,null,{"$f":"IF(OR('Cologne 2016'!$E$49='Cologne 2016'!F49,'Cologne 2016'!$E$49='Cologne 2016'!F50,'Cologne 2016'!$E$49='Cologne 2016'!F48),2,0)","v":0},{"$f":"IF(OR('Cologne 2016'!$E$49='Cologne 2016'!G49,'Cologne 2016'!$E$49='Cologne 2016'!G50,'Cologne 2016'!$E$49='Cologne 2016'!G48),2,0)","v":0},{"$f":"IF(OR('Cologne 2016'!$E$49='Cologne 2016'!H49,'Cologne 2016'!$E$49='Cologne 2016'!H50,'Cologne 2016'!$E$49='Cologne 2016'!H48),2,0)","v":0},{"$f":"IF(OR('Cologne 2016'!$E$49='Cologne 2016'!I49,'Cologne 2016'!$E$49='Cologne 2016'!I50,'Cologne 2016'!$E$49='Cologne 2016'!I48),2,0)","v":0},{"$f":"IF(OR('Cologne 2016'!$E$49='Cologne 2016'!J49,'Cologne 2016'!$E$49='Cologne 2016'!J50,'Cologne 2016'!$E$49='Cologne 2016'!J48),2,0)","v":0},{"$f":"IF(OR('Cologne 2016'!$E$49='Cologne 2016'!K49,'Cologne 2016'!$E$49='Cologne 2016'!K50,'Cologne 2016'!$E$49='Cologne 2016'!K48),2,0)","v":0},{"$f":"IF(OR('Cologne 2016'!$E$49='Cologne 2016'!L49,'Cologne 2016'!$E$49='Cologne 2016'!L50,'Cologne 2016'!$E$49='Cologne 2016'!L48),2,0)","v":0},{"$f":"IF(OR('Cologne 2016'!$E$49='Cologne 2016'!M49,'Cologne 2016'!$E$49='Cologne 2016'!M50,'Cologne 2016'!$E$49='Cologne 2016'!M48),2,0)","v":0},{"$f":"IF(OR('Cologne 2016'!$E$49='Cologne 2016'!N49,'Cologne 2016'!$E$49='Cologne 2016'!N50,'Cologne 2016'!$E$49='Cologne 2016'!N48),2,0)","v":0},{"$f":"IF(OR('Cologne 2016'!$E$49='Cologne 2016'!O49,'Cologne 2016'!$E$49='Cologne 2016'!O50,'Cologne 2016'!$E$49='Cologne 2016'!O48),2,0)","v":2},{"$f":"IF(OR('Cologne 2016'!$E$49='Cologne 2016'!P49,'Cologne 2016'!$E$49='Cologne 2016'!P50,'Cologne 2016'!$E$49='Cologne 2016'!P48),2,0)","v":0},{"$f":"IF(OR('Cologne 2016'!$E$49='Cologne 2016'!Q49,'Cologne 2016'!$E$49='Cologne 2016'!Q50,'Cologne 2016'!$E$49='Cologne 2016'!Q48),2,0)","v":0},{"$f":"IF(OR('Cologne 2016'!$E$49='Cologne 2016'!R49,'Cologne 2016'!$E$49='Cologne 2016'!R50,'Cologne 2016'!$E$49='Cologne 2016'!R48),2,0)","v":0},{"$f":"IF(OR('Cologne 2016'!$E$49='Cologne 2016'!S49,'Cologne 2016'!$E$49='Cologne 2016'!S50,'Cologne 2016'!$E$49='Cologne 2016'!S48),2,0)","v":0},{"$f":"IF(OR('Cologne 2016'!$E$49='Cologne 2016'!T49,'Cologne 2016'!$E$49='Cologne 2016'!T50,'Cologne 2016'!$E$49='Cologne 2016'!T48),2,0)","v":0}]
[null,null,null,null,null,{"$f":"IF(OR('Cologne 2016'!$E$50='Cologne 2016'!F49,'Cologne 2016'!$E$50='Cologne 2016'!F50,'Cologne 2016'!$E$50='Cologne 2016'!F48),2,0)","v":0},{"$f":"IF(OR('Cologne 2016'!$E$50='Cologne 2016'!G49,'Cologne 2016'!$E$50='Cologne 2016'!G50,'Cologne 2016'!$E$50='Cologne 2016'!G48),2,0)","v":0},{"$f":"IF(OR('Cologne 2016'!$E$50='Cologne 2016'!H49,'Cologne 2016'!$E$50='Cologne 2016'!H50,'Cologne 2016'!$E$50='Cologne 2016'!H48),2,0)","v":0},{"$f":"IF(OR('Cologne 2016'!$E$50='Cologne 2016'!I49,'Cologne 2016'!$E$50='Cologne 2016'!I50,'Cologne 2016'!$E$50='Cologne 2016'!I48),2,0)","v":0},{"$f":"IF(OR('Cologne 2016'!$E$50='Cologne 2016'!J49,'Cologne 2016'!$E$50='Cologne 2016'!J50,'Cologne 2016'!$E$50='Cologne 2016'!J48),2,0)","v":0},{"$f":"IF(OR('Cologne 2016'!$E$50='Cologne 2016'!K49,'Cologne 2016'!$E$50='Cologne 2016'!K50,'Cologne 2016'!$E$50='Cologne 2016'!K48),2,0)","v":0},{"$f":"IF(OR('Cologne 2016'!$E$50='Cologne 2016'!L49,'Cologne 2016'!$E$50='Cologne 2016'!L50,'Cologne 2016'!$E$50='Cologne 2016'!L48),2,0)","v":0},{"$f":"IF(OR('Cologne 2016'!$E$50='Cologne 2016'!M49,'Cologne 2016'!$E$50='Cologne 2016'!M50,'Cologne 2016'!$E$50='Cologne 2016'!M48),2,0)","v":0},{"$f":"IF(OR('Cologne 2016'!$E$50='Cologne 2016'!N49,'Cologne 2016'!$E$50='Cologne 2016'!N50,'Cologne 2016'!$E$50='Cologne 2016'!N48),2,0)","v":0},{"$f":"IF(OR('Cologne 2016'!$E$50='Cologne 2016'!O49,'Cologne 2016'!$E$50='Cologne 2016'!O50,'Cologne 2016'!$E$50='Cologne 2016'!O48),2,0)","v":0},{"$f":"IF(OR('Cologne 2016'!$E$50='Cologne 2016'!P49,'Cologne 2016'!$E$50='Cologne 2016'!P50,'Cologne 2016'!$E$50='Cologne 2016'!P48),2,0)","v":0},{"$f":"IF(OR('Cologne 2016'!$E$50='Cologne 2016'!Q49,'Cologne 2016'!$E$50='Cologne 2016'!Q50,'Cologne 2016'!$E$50='Cologne 2016'!Q48),2,0)","v":0},{"$f":"IF(OR('Cologne 2016'!$E$50='Cologne 2016'!R49,'Cologne 2016'!$E$50='Cologne 2016'!R50,'Cologne 2016'!$E$50='Cologne 2016'!R48),2,0)","v":0},{"$f":"IF(OR('Cologne 2016'!$E$50='Cologne 2016'!S49,'Cologne 2016'!$E$50='Cologne 2016'!S50,'Cologne 2016'!$E$50='Cologne 2016'!S48),2,0)","v":0},{"$f":"IF(OR('Cologne 2016'!$E$50='Cologne 2016'!T49,'Cologne 2016'!$E$50='Cologne 2016'!T50,'Cologne 2016'!$E$50='Cologne 2016'!T48),2,0)","v":0}]

{"sheet":"Data","index":3,"n_rows":65,"n_cols":21,"rows_kept":65,"cut":false,"hidden":false,"merged":[[1,2,4,2],[5,2,8,2],[9,2,12,2],[13,2,14,2],[15,2,16,2],[54,2,59,2],[20,2,42,2],[44,2,47,2],[48,2,49,2],[50,2,51,2]]}
["Liste des équipes",null,null,"peRf","Cpassimal","douzer","Budo","mikeu","waz","ventur","Nico","doyl",null,"Joueur","Points",null,"Joueur","Points",null,"Joueur","Pts"]
["NiP",null,"1ers de groupe",{"$f":"IF('Tableau de bord'!E3='Tableau de bord'!$D3,5,0)","v":5},{"$f":"IF('Tableau de bord'!F3='Tableau de bord'!$D3,5,0)","v":0},{"$f":"IF('Tableau de bord'!G3='Tableau de bord'!$D3,5,0)","v":5},{"$f":"IF('Tableau de bord'!H3='Tableau de bord'!$D3,5,0)","v":5},{"$f":"IF('Tableau de bord'!I3='Tableau de bord'!$D3,5,0)","v":5},{"$f":"IF('Tableau de bord'!J3='Tableau de bord'!$D3,5,0)","v":0},{"$f":"IF('Tableau de bord'!K3='Tableau de bord'!$D3,5,0)","v":0},{"$f":"IF('Tableau de bord'!L3='Tableau de bord'!$D3,5,0)","v":5},{"$f":"IF('Tableau de bord'!M3='Tableau de bord'!$D3,5,0)","v":5},null,{"$f":"'Tableau de bord'!G2","v":"douzer"},{"$f":"'Tableau de bord'!G35","v":52},null,{"$f":"'OMFG Week'!B5","v":"neo"},{"$f":"'OMFG Week'!G5","v":3377.6000000000004},null,{"$f":"'Cologne 2016'!O2","v":"DOUZER"},{"$f":"'Cologne 2016'!O53","v":92}]
["TSM",null,null,{"$f":"IF('Tableau de bord'!E4='Tableau de bord'!$D4,5,0)","v":5},{"$f":"IF('Tableau de bord'!F4='Tableau de bord'!$D4,5,0)","v":5},{"$f":"IF('Tableau de bord'!G4='Tableau de bord'!$D4,5,0)","v":5},{"$f":"IF('Tableau de bord'!H4='Tableau de bord'!$D4,5,0)","v":0},{"$f":"IF('Tableau de bord'!I4='Tableau de bord'!$D4,5,0)","v":5},{"$f":"IF('Tableau de bord'!J4='Tableau de bord'!$D4,5,0)","v":5},{"$f":"IF('Tableau de bord'!K4='Tableau de bord'!$D4,5,0)","v":5},{"$f":"IF('Tableau de bord'!L4='Tableau de bord'!$D4,5,0)","v":5},{"$f":"IF('Tableau de bord'!M4='Tableau de bord'!$D4,5,0)","v":0},null,{"$f":"'Tableau de bord'!L2","v":"Nico"},{"$f":"'Tableau de bord'!L35","v":52},null,{"$f":"'OMFG Week'!B4","v":"peRf"},{"$f":"'OMFG Week'!G4","v":2806.7},null,{"$f":"'Cologne 2016'!M2","v":"MIKEU"},{"$f":"'Cologne 2016'!M53","v":84}]
["Renegades",null,null,{"$f":"IF('Tableau de bord'!E5='Tableau de bord'!$D5,5,0)","v":5},{"$f":"IF('Tableau de bord'!F5='Tableau de bord'!$D5,5,0)","v":5},{"$f":"IF('Tableau de bord'!G5='Tableau de bord'!$D5,5,0)","v":5},{"$f":"IF('Tableau de bord'!H5='Tableau de bord'!$D5,5,0)","v":5},{"$f":"IF('Tableau de bord'!I5='Tableau de bord'!$D5,5,0)","v":5},{"$f":"IF('Tableau de bord'!J5='Tableau de bord'!$D5,5,0)","v":5},{"$f":"IF('Tableau de bord'!K5='Tableau de bord'!$D5,5,0)","v":5},{"$f":"IF('Tableau de bord'!L5='Tableau de bord'!$D5,5,0)","v":5},{"$f":"IF('Tableau de bord'!M5='Tableau de bord'!$D5,5,0)","v":5},null,{"$f":"'Tableau de bord'!E2","v":"peRf"},{"$f":"'Tableau de bord'!E35","v":60},null,{"$f":"'OMFG Week'!B6","v":"douzer"},{"$f":"'OMFG Week'!G6","v":2064.6},null,{"$f":"'Cologne 2016'!I2","v":"KEVNAY"},{"$f":"'Cologne 2016'!I53","v":83}]
["CLG",null,null,{"$f":"IF('Tableau de bord'!E6='Tableau de bord'!$D6,5,0)","v":0},{"$f":"IF('Tableau de bord'!F6='Tableau de bord'!$D6,5,0)","v":5},{"$f":"IF('Tableau de bord'!G6='Tableau de bord'!$D6,5,0)","v":5},{"$f":"IF('Tableau de bord'!H6='Tableau de bord'!$D6,5,0)","v":0},{"$f":"IF('Tableau de bord'!I6='Tableau de bord'!$D6,5,0)","v":0},{"$f":"IF('Tableau de bord'!J6='Tableau de bord'!$D6,5,0)","v":0},{"$f":"IF('Tableau de bord'!K6='Tableau de bord'!$D6,5,0)","v":5},{"$f":"IF('Tableau de bord'!L6='Tableau de bord'!$D6,5,0)","v":5},{"$f":"IF('Tableau de bord'!M6='Tableau de bord'!$D6,5,0)","v":0},null,{"$f":"'Tableau de bord'!F2","v":"Cpassimal"},{"$f":"'Tableau de bord'!F35","v":36},null,{"$f":"'OMFG Week'!B9","v":"kid"},{"$f":"'OMFG Week'!G9","v":1276.8},null,{"$f":"'Cologne 2016'!N2","v":"CPASSIMAL"},{"$f":"'Cologne 2016'!N53","v":83}]
["nV",null,"Repéchés",{"$f":"IF(OR('Tableau de bord'!E10='Tableau de bord'!$B$10,'Tableau de bord'!E10='Tableau de bord'!$B$11,'Tableau de bord'!E10='Tableau de bord'!$B$12,'Tableau de bord'!E10='Tableau de bord'!$B$13),3,0)","v":3},{"$f":"IF(OR('Tableau de bord'!F10='Tableau de bord'!$B$10,'Tableau de bord'!F10='Tableau de bord'!$B$11,'Tableau de bord'!F10='Tableau de bord'!$B$12,'Tableau de bord'!F10='Tableau de bord'!$B$13),3,0)","v":3},{"$f":"IF(OR('Tableau de bord'!G10='Tableau de bord'!$B$10,'Tableau de bord'!G10='Tableau de bord'!$B$11,'Tableau de bord'!G10='Tableau de bord'!$B$12,'Tableau de bord'!G10='Tableau de bord'!$B$13),3,0)","v":3},{"$f":"IF(OR('Tableau de bord'!H10='Tableau de bord'!$B$10,'Tableau de bord'!H10='Tableau de bord'!$B$11,'Tableau de bord'!H10='Tableau de bord'!$B$12,'Tableau de bord'!H10='Tableau de bord'!$B$13),3,0)","v":3},{"$f":"IF(OR('Tableau de bord'!I10='Tableau de bord'!$B$10,'Tableau de bord'!I10='Tableau de bord'!$B$11,'Tableau de bord'!I10='Tableau de bord'!$B$12,'Tableau de bord'!I10='Tableau de bord'!$B$13),3,0)","v":0},{"$f":"IF(OR('Tableau de bord'!J10='Tableau de bord'!$B$10,'Tableau de bord'!J10='Tableau de bord'!$B$11,'Tableau de bord'!J10='Tableau de bord'!$B$12,'Tableau de bord'!J10='Tableau de bord'!$B$13),3,0)","v":3},{"$f":"IF(OR('Tableau de bord'!K10='Tableau de bord'!$B$10,'Tableau de bord'!K10='Tableau de bord'!$B$11,'Tableau de bord'!K10='Tableau de bord'!$B$12,'Tableau de bord'!K10='Tableau de bord'!$B$13),3,0)","v":0},{"$f":"IF(OR('Tableau de bord'!L10='Tableau de bord'!$B$10,'Tableau de bord'!L10='Tableau de bord'!$B$11,'Tableau de bord'!L10='Tableau de bord'!$B$12,'Tableau de bord'!L10='Tableau de bord'!$B$13),3,0)","v":3},{"$f":"IF(OR('Tableau de bord'!M10='Tableau de bord'!$B$10,'Tableau de bord'!M10='Tableau de bord'!$B$11,'Tableau de bord'!M10='Tableau de bord'!$B$12,'Tableau de bord'!M10='Tableau de bord'!$B$13),3,0)","v":0},null,{"$f":"'Tableau de bord'!K2","v":"ventur"},{"$f":"'Tableau de bord'!K35","v":42},null,{"$f":"'OMFG Week'!B8","v":"ventur"},{"$f":"'OMFG Week'!G8","v":1266},null,{"$f":"'Cologne 2016'!L2","v":"VENTUR"},{"$f":"'Cologne 2016'!L53","v":81}]
["Luminosity",null,null,{"$f":"IF(OR('Tableau de bord'!E11='Tableau de bord'!$B$10,'Tableau de bord'!E11='Tableau de bord'!$B$11,'Tableau de bord'!E11='Tableau de bord'!$B$12,'Tableau de bord'!E11='Tableau de bord'!$B$13),3,0)","v":3},{"$f":"IF(OR('Tableau de bord'!F11='Tableau de bord'!$B$10,'Tableau de bord'!F11='Tableau de bord'!$B$11,'Tableau de bord'!F11='Tableau de bord'!$B$12,'Tableau de bord'!F11='Tableau de bord'!$B$13),3,0)","v":0},{"$f":"IF(OR('Tableau de bord'!G11='Tableau de bord'!$B$10,'Tableau de bord'!G11='Tableau de bord'!$B$11,'Tableau de bord'!G11='Tableau de bord'!$B$12,'Tableau de bord'!G11='Tableau de bord'!$B$13),3,0)","v":3},{"$f":"IF(OR('Tableau de bord'!H11='Tableau de bord'!$B$10,'Tableau de bord'!H11='Tableau de bord'!$B$11,'Tableau de bord'!H11='Tableau de bord'!$B$12,'Tableau de bord'!H11='Tableau de bord'!$B$13),3,0)","v":0},{"$f":"IF(OR('Tableau de bord'!I11='Tableau de bord'!$B$10,'Tableau de bord'!I11='Tableau de bord'!$B$11,'Tableau de bord'!I11='Tableau de bord'!$B$12,'Tableau de bord'!I11='Tableau de bord'!$B$13),3,0)","v":3},{"$f":"IF(OR('Tableau de bord'!J11='Tableau de bord'!$B$10,'Tableau de bord'!J11='Tableau de bord'!$B$11,'Tableau de bord'!J11='Tableau de bord'!$B$12,'Tableau de bord'!J11='Tableau de bord'!$B$13),3,0)","v":0},{"$f":"IF(OR('Tableau de bord'!K11='Tableau de bord'!$B$10,'Tableau de bord'!K11='Tableau de bord'!$B$11,'Tableau de bord'!K11='Tableau de bord'!$B$12,'Tableau de bord'!K11='Tableau de bord'!$B$13),3,0)","v":3},{"$f":"IF(OR('Tableau de bord'!L11='Tableau de bord'!$B$10,'Tableau de bord'!L11='Tableau de bord'!$B$11,'Tableau de bord'!L11='Tableau de bord'!$B$12,'Tableau de bord'!L11='Tableau de bord'!$B$13),3,0)","v":3},{"$f":"IF(OR('Tableau de bord'!M11='Tableau de bord'!$B$10,'Tableau de bord'!M11='Tableau de bord'!$B$11,'Tableau de bord'!M11='Tableau de bord'!$B$12,'Tableau de bord'!M11='Tableau de bord'!$B$13),3,0)","v":0},null,{"$f":"'Tableau de bord'!I2","v":"mikeu"},{"$f":"'Tableau de bord'!I35","v":39},null,{"$f":"'OMFG Week'!B13","v":"cpassimal"},{"$f":"'OMFG Week'!G13","v":702.90000000000009},null,{"$f":"'Cologne 2016'!J2","v":"NICO"},{"$f":"'Cologne 2016'!J53","v":69}]
["Kinguin",null,null,{"$f":"IF(OR('Tableau de bord'!E12='Tableau de bord'!$B$10,'Tableau de bord'!E12='Tableau de bord'!$B$11,'Tableau de bord'!E12='Tableau de bord'!$B$12,'Tableau de bord'!E12='Tableau de bord'!$B$13),3,0)","v":0},{"$f":"IF(OR('Tableau de bord'!F12='Tableau de bord'!$B$10,'Tableau de bord'!F12='Tableau de bord'!$B$11,'Tableau de bord'!F12='Tableau de bord'!$B$12,'Tableau de bord'!F12='Tableau de bord'!$B$13),3,0)","v":0},{"$f":"IF(OR('Tableau de bord'!G12='Tableau de bord'!$B$10,'Tableau de bord'!G12='Tableau de bord'!$B$11,'Tableau de bord'!G12='Tableau de bord'!$B$12,'Tableau de bord'!G12='Tableau de bord'!$B$13),3,0)","v":0},{"$f":"IF(OR('Tableau de bord'!H12='Tableau de bord'!$B$10,'Tableau de bord'!H12='Tableau de bord'!$B$11,'Tableau de bord'!H12='Tableau de bord'!$B$12,'Tableau de bord'!H12='Tableau de bord'!$B$13),3,0)","v":0},{"$f":"IF(OR('Tableau de bord'!I12='Tableau de bord'!$B$10,'Tableau de bord'!I12='Tableau de bord'!$B$11,'Tableau de bord'!I12='Tableau de bord'!$B$12,'Tableau de bord'!I12='Tableau de bord'!$B$13),3,0)","v":3},{"$f":"IF(OR('Tableau de bord'!J12='Tableau de bord'!$B$10,'Tableau de bord'!J12='Tableau de bord'!$B$11,'Tableau de bord'!J12='Tableau de bord'!$B$12,'Tableau de bord'!J12='Tableau de bord'!$B$13),3,0)","v":0},{"$f":"IF(OR('Tableau de bord'!K12='Tableau de bord'!$B$10,'Tableau de bord'!K12='Tableau de bord'!$B$11,'Tableau de bord'!K12='Tableau de bord'!$B$12,'Tableau de bord'!K12='Tableau de bord'!$B$13),3,0)","v":3},{"$f":"IF(OR('Tableau de bord'!L12='Tableau de bord'!$B$10,'Tableau de bord'!L12='Tableau de bord'!$B$11,'Tableau de bord'!L12='Tableau de bord'!$B$12,'Tableau de bord'!L12='Tableau de bord'!$B$13),3,0)","v":0},{"$f":"IF(OR('Tableau de bord'!M12='Tableau de bord'!$B$10,'Tableau de bord'!M12='Tableau de bord'!$B$11,'Tableau de bord'!M12='Tableau de bord'!$B$12,'Tableau de bord'!M12='Tableau de bord'!$B$13),3,0)","v":0},null,{"$f":"'Tableau de bord'!H2","v":"Budo"},{"$f":"'Tableau de bord'!H35","v":34},null,{"$f":"'OMFG Week'!B10","v":"epicier"},{"$f":"'OMFG Week'!G10","v":525.20000000000005},null,{"$f":"'Cologne 2016'!P2","v":"PERF"},{"$f":"'Cologne 2016'!P53","v":65}]
["Flipside",null,null,{"$f":"IF(OR('Tableau de bord'!E13='Tableau de bord'!$B$10,'Tableau de bord'!E13='Tableau de bord'!$B$11,'Tableau de bord'!E13='Tableau de bord'!$B$12,'Tableau de bord'!E13='Tableau de bord'!$B$13),3,0)","v":3},{"$f":"IF(OR('Tableau de bord'!F13='Tableau de bord'!$B$10,'Tableau de bord'!F13='Tableau de bord'!$B$11,'Tableau de bord'!F13='Tableau de bord'!$B$12,'Tableau de bord'!F13='Tableau de bord'!$B$13),3,0)","v":0},{"$f":"IF(OR('Tableau de bord'!G13='Tableau de bord'!$B$10,'Tableau de bord'!G13='Tableau de bord'!$B$11,'Tableau de bord'!G13='Tableau de bord'!$B$12,'Tableau de bord'!G13='Tableau de bord'!$B$13),3,0)","v":0},{"$f":"IF(OR('Tableau de bord'!H13='Tableau de bord'!$B$10,'Tableau de bord'!H13='Tableau de bord'!$B$11,'Tableau de bord'!H13='Tableau de bord'!$B$12,'Tableau de bord'!H13='Tableau de bord'!$B$13),3,0)","v":0},{"$f":"IF(OR('Tableau de bord'!I13='Tableau de bord'!$B$10,'Tableau de bord'!I13='Tableau de bord'!$B$11,'Tableau de bord'!I13='Tableau de bord'!$B$12,'Tableau de bord'!I13='Tableau de bord'!$B$13),3,0)","v":0},{"$f":"IF(OR('Tableau de bord'!J13='Tableau de bord'!$B$10,'Tableau de bord'!J13='Tableau de bord'!$B$11,'Tableau de bord'!J13='Tableau de bord'!$B$12,'Tableau de bord'!J13='Tableau de bord'!$B$13),3,0)","v":0},{"$f":"IF(OR('Tableau de bord'!K13='Tableau de bord'!$B$10,'Tableau de bord'!K13='Tableau de bord'!$B$11,'Tableau de bord'!K13='Tableau de bord'!$B$12,'Tableau de bord'!K13='Tableau de bord'!$B$13),3,0)","v":0},{"$f":"IF(OR('Tableau de bord'!L13='Tableau de bord'!$B$10,'Tableau de bord'!L13='Tableau de bord'!$B$11,'Tableau de bord'!L13='Tableau de bord'!$B$12,'Tableau de bord'!L13='Tableau de bord'!$B$13),3,0)","v":0},{"$f":"IF(OR('Tableau de bord'!M13='Tableau de bord'!$B$10,'Tableau de bord'!M13='Tableau de bord'!$B$11,'Tableau de bord'!M13='Tableau de bord'!$B$12,'Tableau de bord'!M13='Tableau de bord'!$B$13),3,0)","v":0},null,{"$f":"'Tableau de bord'!M2","v":"doyl"},{"$f":"'Tableau de bord'!M35","v":31},null,{"$f":"'OMFG Week'!B12","v":"doyl"},{"$f":"'OMFG Week'!G12","v":454.99999999999994},null,{"$f":"'Cologne 2016'!F2","v":"DOYL"},{"$f":"'Cologne 2016'!F53","v":58}]
["fnatic",null,"Quarts",{"$f":"IF('Tableau de bord'!E18='Tableau de bord'!$D18,8,IF(OR(LEFT('Tableau de bord'!E18,1)=LEFT('Tableau de bord'!$D18,1),RIGHT('Tableau de bord'!E18,1)=RIGHT('Tableau de bord'!$D18,1)),5,0))","v":5},{"$f":"IF('Tableau de bord'!F18='Tableau de bord'!$D18,8,IF(OR(LEFT('Tableau de bord'!F18,1)=LEFT('Tableau de bord'!$D18,1),RIGHT('Tableau de bord'!F18,1)=RIGHT('Tableau de bord'!$D18,1)),5,0))","v":5},{"$f":"IF('Tableau de bord'!G18='Tableau de bord'!$D18,8,IF(OR(LEFT('Tableau de bord'!G18,1)=LEFT('Tableau de bord'!$D18,1),RIGHT('Tableau de bord'!G18,1)=RIGHT('Tableau de bord'!$D18,1)),5,0))","v":8},{"$f":"IF('Tableau de bord'!H18='Tableau de bord'!$D18,8,IF(OR(LEFT('Tableau de bord'!H18,1)=LEFT('Tableau de bord'!$D18,1),RIGHT('Tableau de bord'!H18,1)=RIGHT('Tableau de bord'!$D18,1)),5,0))","v":5},{"$f":"IF('Tableau de bord'!I18='Tableau de bord'!$D18,8,IF(OR(LEFT('Tableau de bord'!I18,1)=LEFT('Tableau de bord'!$D18,1),RIGHT('Tableau de bord'!I18,1)=RIGHT('Tableau de bord'!$D18,1)),5,0))","v":8},{"$f":"IF('Tableau de bord'!J18='Tableau de bord'!$D18,8,IF(OR(LEFT('Tableau de bord'!J18,1)=LEFT('Tableau de bord'!$D18,1),RIGHT('Tableau de bord'!J18,1)=RIGHT('Tableau de bord'!$D18,1)),5,0))","v":0},{"$f":"IF('Tableau de bord'!K18='Tableau de bord'!$D18,8,IF(OR(LEFT('Tableau de bord'!K18,1)=LEFT('Tableau de bord'!$D18,1),RIGHT('Tableau de bord'!K18,1)=RIGHT('Tableau de bord'!$D18,1)),5,0))","v":8},{"$f":"IF('Tableau de bord'!L18='Tableau de bord'!$D18,8,IF(OR(LEFT('Tableau de bord'!L18,1)=LEFT('Tableau de bord'!$D18,1),RIGHT('Tableau de bord'!L18,1)=RIGHT('Tableau de bord'!$D18,1)),5,0))","v":5},{"$f":"IF('Tableau de bord'!M18='Tableau de bord'!$D18,8,IF(OR(LEFT('Tableau de bord'!M18,1)=LEFT('Tableau de bord'!$D18,1),RIGHT('Tableau de bord'!M18,1)=RIGHT('Tableau de bord'!$D18,1)),5,0))","v":5},null,{"$f":"'Tableau de bord'!J2","v":"waz"},{"$f":"'Tableau de bord'!J35","v":21},null,{"$f":"'OMFG Week'!B7","v":"pat"},{"$f":"'OMFG Week'!G7","v":316.8},null,{"$f":"'Cologne 2016'!H2","v":"DARKS"},{"$f":"'Cologne 2016'!H53","v":49}]
["NaVi",null,null,{"$f":"IF('Tableau de bord'!E19='Tableau de bord'!$D19,8,IF(OR(LEFT('Tableau de bord'!E19,1)=LEFT('Tableau de bord'!$D19,1),RIGHT('Tableau de bord'!E19,1)=RIGHT('Tableau de bord'!$D19,1)),5,0))","v":8},{"$f":"IF('Tableau de bord'!F19='Tableau de bord'!$D19,8,IF(OR(LEFT('Tableau de bord'!F19,1)=LEFT('Tableau de bord'!$D19,1),RIGHT('Tableau de bord'!F19,1)=RIGHT('Tableau de bord'!$D19,1)),5,0))","v":5},{"$f":"IF('Tableau de bord'!G19='Tableau de bord'!$D19,8,IF(OR(LEFT('Tableau de bord'!G19,1)=LEFT('Tableau de bord'!$D19,1),RIGHT('Tableau de bord'!G19,1)=RIGHT('Tableau de bord'!$D19,1)),5,0))","v":5},{"$f":"IF('Tableau de bord'!H19='Tableau de bord'!$D19,8,IF(OR(LEFT('Tableau de bord'!H19,1)=LEFT('Tableau de bord'!$D19,1),RIGHT('Tableau de bord'!H19,1)=RIGHT('Tableau de bord'!$D19,1)),5,0))","v":8},{"$f":"IF('Tableau de bord'!I19='Tableau de bord'!$D19,8,IF(OR(LEFT('Tableau de bord'!I19,1)=LEFT('Tableau de bord'!$D19,1),RIGHT('Tableau de bord'!I19,1)=RIGHT('Tableau de bord'!$D19,1)),5,0))","v":5},{"$f":"IF('Tableau de bord'!J19='Tableau de bord'!$D19,8,IF(OR(LEFT('Tableau de bord'!J19,1)=LEFT('Tableau de bord'!$D19,1),RIGHT('Tableau de bord'!J19,1)=RIGHT('Tableau de bord'!$D19,1)),5,0))","v":0},{"$f":"IF('Tableau de bord'!K19='Tableau de bord'!$D19,8,IF(OR(LEFT('Tableau de bord'!K19,1)=LEFT('Tableau de bord'!$D19,1),RIGHT('Tableau de bord'!K19,1)=RIGHT('Tableau de bord'!$D19,1)),5,0))","v":5},{"$f":"IF('Tableau de bord'!L19='Tableau de bord'!$D19,8,IF(OR(LEFT('Tableau de bord'!L19,1)=LEFT('Tableau de bord'!$D19,1),RIGHT('Tableau de bord'!L19,1)=RIGHT('Tableau de bord'!$D19,1)),5,0))","v":8},{"$f":"IF('Tableau de bord'!M19='Tableau de bord'!$D19,8,IF(OR(LEFT('Tableau de bord'!M19,1)=LEFT('Tableau de bord'!$D19,1),RIGHT('Tableau de bord'!M19,1)=RIGHT('Tableau de bord'!$D19,1)),5,0))","v":0},null,null,null,null,{"$f":"'OMFG Week'!B11","v":"quentin"},{"$f":"'OMFG Week'!G11","v":118.8},null,{"$f":"'Cologne 2016'!K2","v":"BUDO"},{"$f":"'Cologne 2016'!K53","v":38}]
["Titan",null,null,{"$f":"IF('Tableau de bord'!E20='Tableau de bord'!$D20,8,IF(OR(LEFT('Tableau de bord'!E20,1)=LEFT('Tableau de bord'!$D20,1),RIGHT('Tableau de bord'!E20,1)=RIGHT('Tableau de bord'!$D20,1)),5,0))","v":0},{"$f":"IF('Tableau de bord'!F20='Tableau de bord'!$D20,8,IF(OR(LEFT('Tableau de bord'!F20,1)=LEFT('Tableau de bord'!$D20,1),RIGHT('Tableau de bord'!F20,1)=RIGHT('Tableau de bord'!$D20,1)),5,0))","v":0},{"$f":"IF('Tableau de bord'!G20='Tableau de bord'!$D20,8,IF(OR(LEFT('Tableau de bord'!G20,1)=LEFT('Tableau de bord'!$D20,1),RIGHT('Tableau de bord'!G20,1)=RIGHT('Tableau de bord'!$D20,1)),5,0))","v":5},{"$f":"IF('Tableau de bord'!H20='Tableau de bord'!$D20,8,IF(OR(LEFT('Tableau de bord'!H20,1)=LEFT('Tableau de bord'!$D20,1),RIGHT('Tableau de bord'!H20,1)=RIGHT('Tableau de bord'!$D20,1)),5,0))","v":0},{"$f":"IF('Tableau de bord'!I20='Tableau de bord'!$D20,8,IF(OR(LEFT('Tableau de bord'!I20,1)=LEFT('Tableau de bord'!$D20,1),RIGHT('Tableau de bord'!I20,1)=RIGHT('Tableau de bord'!$D20,1)),5,0))","v":0},{"$f":"IF('Tableau de bord'!J20='Tableau de bord'!$D20,8,IF(OR(LEFT('Tableau de bord'!J20,1)=LEFT('Tableau de bord'!$D20,1),RIGHT('Tableau de bord'!J20,1)=RIGHT('Tableau de bord'!$D20,1)),5,0))","v":0},{"$f":"IF('Tableau de bord'!K20='Tableau de bord'!$D20,8,IF(OR(LEFT('Tableau de bord'!K20,1)=LEFT('Tableau de bord'!$D20,1),RIGHT('Tableau de bord'!K20,1)=RIGHT('Tableau de bord'!$D20,1)),5,0))","v":0},{"$f":"IF('Tableau de bord'!L20='Tableau de bord'!$D20,8,IF(OR(LEFT('Tableau de bord'!L20,1)=LEFT('Tableau de bord'!$D20,1),RIGHT('Tableau de bord'!L20,1)=RIGHT('Tableau de bord'!$D20,1)),5,0))","v":5},{"$f":"IF('Tableau de bord'!M20='Tableau de bord'!$D20,8,IF(OR(LEFT('Tableau de bord'!M20,1)=LEFT('Tableau de bord'!$D20,1),RIGHT('Tableau de bord'!M20,1)=RIGHT('Tableau de bord'!$D20,1)),5,0))","v":8},null,null,null,null,{"$f":"'OMFG Week'!B14","v":"axwell"},{"$f":"'OMFG Week'!G14","v":79.2},null,{"$f":"'Cologne 2016'!G2","v":"EPICIER"},{"$f":"'Cologne 2016'!G53","v":18}]
["eBettle",null,null,{"$f":"IF('Tableau de bord'!E21='Tableau de bord'!$D21,8,IF(OR(LEFT('Tableau de bord'!E21,1)=LEFT('Tableau de bord'!$D21,1),RIGHT('Tableau de bord'!E21,1)=RIGHT('Tableau de bord'!$D21,1)),5,0))","v":8},{"$f":"IF('Tableau de bord'!F21='Tableau de bord'!$D21,8,IF(OR(LEFT('Tableau de bord'!F21,1)=LEFT('Tableau de bord'!$D21,1),RIGHT('Tableau de bord'!F21,1)=RIGHT('Tableau de bord'!$D21,1)),5,0))","v":8},{"$f":"IF('Tableau de bord'!G21='Tableau de bord'!$D21,8,IF(OR(LEFT('Tableau de bord'!G21,1)=LEFT('Tableau de bord'!$D21,1),RIGHT('Tableau de bord'!G21,1)=RIGHT('Tableau de bord'!$D21,1)),5,0))","v":8},{"$f":"IF('Tableau de bord'!H21='Tableau de bord'!$D21,8,IF(OR(LEFT('Tableau de bord'!H21,1)=LEFT('Tableau de bord'!$D21,1),RIGHT('Tableau de bord'!H21,1)=RIGHT('Tableau de bord'!$D21,1)),5,0))","v":8},{"$f":"IF('Tableau de bord'!I21='Tableau de bord'!$D21,8,IF(OR(LEFT('Tableau de bord'!I21,1)=LEFT('Tableau de bord'!$D21,1),RIGHT('Tableau de bord'!I21,1)=RIGHT('Tableau de bord'!$D21,1)),5,0))","v":5},{"$f":"IF('Tableau de bord'!J21='Tableau de bord'!$D21,8,IF(OR(LEFT('Tableau de bord'!J21,1)=LEFT('Tableau de bord'!$D21,1),RIGHT('Tableau de bord'!J21,1)=RIGHT('Tableau de bord'!$D21,1)),5,0))","v":8},{"$f":"IF('Tableau de bord'!K21='Tableau de bord'!$D21,8,IF(OR(LEFT('Tableau de bord'!K21,1)=LEFT('Tableau de bord'!$D21,1),RIGHT('Tableau de bord'!K21,1)=RIGHT('Tableau de bord'!$D21,1)),5,0))","v":8},{"$f":"IF('Tableau de bord'!L21='Tableau de bord'!$D21,8,IF(OR(LEFT('Tableau de bord'!L21,1)=LEFT('Tableau de bord'!$D21,1),RIGHT('Tableau de bord'!L21,1)=RIGHT('Tableau de bord'!$D21,1)),5,0))","v":8},{"$f":"IF('Tableau de bord'!M21='Tableau de bord'!$D21,8,IF(OR(LEFT('Tableau de bord'!M21,1)=LEFT('Tableau de bord'!$D21,1),RIGHT('Tableau de bord'!M21,1)=RIGHT('Tableau de bord'!$D21,1)),5,0))","v":8},null,null,null,null,{"$f":"'OMFG Week'!B15","v":0},{"$f":"'OMFG Week'!G15","v":0}]
["VP",null,"Demies",{"$f":"IF('Tableau de bord'!E26='Tableau de bord'!$D26,11,IF(OR(LEFT('Tableau de bord'!E26,1)=LEFT('Tableau de bord'!$D26,1),RIGHT('Tableau de bord'!E26,1)=RIGHT('Tableau de bord'!$D26,1)),7,0))","v":0},{"$f":"IF('Tableau de bord'!F26='Tableau de bord'!$D26,11,IF(OR(LEFT('Tableau de bord'!F26,1)=LEFT('Tableau de bord'!$D26,1),RIGHT('Tableau de bord'!F26,1)=RIGHT('Tableau de bord'!$D26,1)),7,0))","v":0},{"$f":"IF('Tableau de bord'!G26='Tableau de bord'!$D26,11,IF(OR(LEFT('Tableau de bord'!G26,1)=LEFT('Tableau de bord'!$D26,1),RIGHT('Tableau de bord'!G26,1)=RIGHT('Tableau de bord'!$D26,1)),7,0))","v":0},{"$f":"IF('Tableau de bord'!H26='Tableau de bord'!$D26,11,IF(OR(LEFT('Tableau de bord'!H26,1)=LEFT('Tableau de bord'!$D26,1),RIGHT('Tableau de bord'!H26,1)=RIGHT('Tableau de bord'!$D26,1)),7,0))","v":0},{"$f":"IF('Tableau de bord'!I26='Tableau de bord'!$D26,11,IF(OR(LEFT('Tableau de bord'!I26,1)=LEFT('Tableau de bord'!$D26,1),RIGHT('Tableau de bord'!I26,1)=RIGHT('Tableau de bord'!$D26,1)),7,0))","v":0},{"$f":"IF('Tableau de bord'!J26='Tableau de bord'!$D26,11,IF(OR(LEFT('Tableau de bord'!J26,1)=LEFT('Tableau de bord'!$D26,1),RIGHT('Tableau de bord'!J26,1)=RIGHT('Tableau de bord'!$D26,1)),7,0))","v":0},{"$f":"IF('Tableau de bord'!K26='Tableau de bord'!$D26,11,IF(OR(LEFT('Tableau de bord'!K26,1)=LEFT('Tableau de bord'!$D26,1),RIGHT('Tableau de bord'!K26,1)=RIGHT('Tableau de bord'!$D26,1)),7,0))","v":0},{"$f":"IF('Tableau de bord'!L26='Tableau de bord'!$D26,11,IF(OR(LEFT('Tableau de bord'!L26,1)=LEFT('Tableau de bord'!$D26,1),RIGHT('Tableau de bord'!L26,1)=RIGHT('Tableau de bord'!$D26,1)),7,0))","v":0},{"$f":"IF('Tableau de bord'!M26='Tableau de bord'!$D26,11,IF(OR(LEFT('Tableau de bord'!M26,1)=LEFT('Tableau de bord'!$D26,1),RIGHT('Tableau de bord'!M26,1)=RIGHT('Tableau de bord'!$D26,1)),7,0))","v":0},null,null,null,null,{"$f":"'OMFG Week'!B16","v":0},{"$f":"'OMFG Week'!G16","v":0}]
["mouz",null,null,{"$f":"IF('Tableau de bord'!E27='Tableau de bord'!$D27,11,IF(OR(LEFT('Tableau de bord'!E27,1)=LEFT('Tableau de bord'!$D27,1),RIGHT('Tableau de bord'!E27,1)=RIGHT('Tableau de bord'!$D27,1)),7,0))","v":0},{"$f":"IF('Tableau de bord'!F27='Tableau de bord'!$D27,11,IF(OR(LEFT('Tableau de bord'!F27,1)=LEFT('Tableau de bord'!$D27,1),RIGHT('Tableau de bord'!F27,1)=RIGHT('Tableau de bord'!$D27,1)),7,0))","v":0},{"$f":"IF('Tableau de bord'!G27='Tableau de bord'!$D27,11,IF(OR(LEFT('Tableau de bord'!G27,1)=LEFT('Tableau de bord'!$D27,1),RIGHT('Tableau de bord'!G27,1)=RIGHT('Tableau de bord'!$D27,1)),7,0))","v":0},{"$f":"IF('Tableau de bord'!H27='Tableau de bord'!$D27,11,IF(OR(LEFT('Tableau de bord'!H27,1)=LEFT('Tableau de bord'!$D27,1),RIGHT('Tableau de bord'!H27,1)=RIGHT('Tableau de bord'!$D27,1)),7,0))","v":0},{"$f":"IF('Tableau de bord'!I27='Tableau de bord'!$D27,11,IF(OR(LEFT('Tableau de bord'!I27,1)=LEFT('Tableau de bord'!$D27,1),RIGHT('Tableau de bord'!I27,1)=RIGHT('Tableau de bord'!$D27,1)),7,0))","v":0},{"$f":"IF('Tableau de bord'!J27='Tableau de bord'!$D27,11,IF(OR(LEFT('Tableau de bord'!J27,1)=LEFT('Tableau de bord'!$D27,1),RIGHT('Tableau de bord'!J27,1)=RIGHT('Tableau de bord'!$D27,1)),7,0))","v":0},{"$f":"IF('Tableau de bord'!K27='Tableau de bord'!$D27,11,IF(OR(LEFT('Tableau de bord'!K27,1)=LEFT('Tableau de bord'!$D27,1),RIGHT('Tableau de bord'!K27,1)=RIGHT('Tableau de bord'!$D27,1)),7,0))","v":0},{"$f":"IF('Tableau de bord'!L27='Tableau de bord'!$D27,11,IF(OR(LEFT('Tableau de bord'!L27,1)=LEFT('Tableau de bord'!$D27,1),RIGHT('Tableau de bord'!L27,1)=RIGHT('Tableau de bord'!$D27,1)),7,0))","v":0},{"$f":"IF('Tableau de bord'!M27='Tableau de bord'!$D27,11,IF(OR(LEFT('Tableau de bord'!M27,1)=LEFT('Tableau de bord'!$D27,1),RIGHT('Tableau de bord'!M27,1)=RIGHT('Tableau de bord'!$D27,1)),7,0))","v":0},null,null,null,null,{"$f":"'OMFG Week'!B17","v":0},{"$f":"'OMFG Week'!G17","v":0}]
["C9",null,"Finale",{"$f":"IF('Tableau de bord'!E32='Tableau de bord'!$D32,15,IF(OR(LEFT('Tableau de bord'!E32,1)=LEFT('Tableau de bord'!$D32,1),RIGHT('Tableau de bord'!E32,1)=RIGHT('Tableau de bord'!$D32,1)),10,0))","v":15},{"$f":"IF('Tableau de bord'!F32='Tableau de bord'!$D32,15,IF(OR(LEFT('Tableau de bord'!F32,1)=LEFT('Tableau de bord'!$D32,1),RIGHT('Tableau de bord'!F32,1)=RIGHT('Tableau de bord'!$D32,1)),10,0))","v":0},{"$f":"IF('Tableau de bord'!G32='Tableau de bord'!$D32,15,IF(OR(LEFT('Tableau de bord'!G32,1)=LEFT('Tableau de bord'!$D32,1),RIGHT('Tableau de bord'!G32,1)=RIGHT('Tableau de bord'!$D32,1)),10,0))","v":0},{"$f":"IF('Tableau de bord'!H32='Tableau de bord'!$D32,15,IF(OR(LEFT('Tableau de bord'!H32,1)=LEFT('Tableau de bord'!$D32,1),RIGHT('Tableau de bord'!H32,1)=RIGHT('Tableau de bord'!$D32,1)),10,0))","v":0},{"$f":"IF('Tableau de bord'!I32='Tableau de bord'!$D32,15,IF(OR(LEFT('Tableau de bord'!I32,1)=LEFT('Tableau de bord'!$D32,1),RIGHT('Tableau de bord'!I32,1)=RIGHT('Tableau de bord'!$D32,1)),10,0))","v":0},{"$f":"IF('Tableau de bord'!J32='Tableau de bord'!$D32,15,IF(OR(LEFT('Tableau de bord'!J32,1)=LEFT('Tableau de bord'!$D32,1),RIGHT('Tableau de bord'!J32,1)=RIGHT('Tableau de bord'!$D32,1)),10,0))","v":0},{"$f":"IF('Tableau de bord'!K32='Tableau de bord'!$D32,15,IF(OR(LEFT('Tableau de bord'!K32,1)=LEFT('Tableau de bord'!$D32,1),RIGHT('Tableau de bord'!K32,1)=RIGHT('Tableau de bord'!$D32,1)),10,0))","v":0},{"$f":"IF('Tableau de bord'!L32='Tableau de bord'!$D32,15,IF(OR(LEFT('Tableau de bord'!L32,1)=LEFT('Tableau de bord'!$D32,1),RIGHT('Tableau de bord'!L32,1)=RIGHT('Tableau de bord'!$D32,1)),10,0))","v":0},{"$f":"IF('Tableau de bord'!M32='Tableau de bord'!$D32,15,IF(OR(LEFT('Tableau de bord'!M32,1)=LEFT('Tableau de bord'!$D32,1),RIGHT('Tableau de bord'!M32,1)=RIGHT('Tableau de bord'!$D32,1)),10,0))","v":0},null,null,null,null,{"$f":"'OMFG Week'!B18","v":0},{"$f":"'OMFG Week'!G18","v":0}]
["Immunity",null,null,{"$f":"IF('Tableau de bord'!$D$33='Tableau de bord'!E33,4,0)","v":0},{"$f":"IF('Tableau de bord'!$D$33='Tableau de bord'!F33,4,0)","v":0},{"$f":"IF('Tableau de bord'!$D$33='Tableau de bord'!G33,4,0)","v":0},{"$f":"IF('Tableau de bord'!$D$33='Tableau de bord'!H33,4,0)","v":0},{"$f":"IF('Tableau de bord'!$D$33='Tableau de bord'!I33,4,0)","v":0},{"$f":"IF('Tableau de bord'!$D$33='Tableau de bord'!J33,4,0)","v":0},{"$f":"IF('Tableau de bord'!$D$33='Tableau de bord'!K33,4,0)","v":0},{"$f":"IF('Tableau de bord'!$D$33='Tableau de bord'!L33,4,0)","v":0},{"$f":"IF('Tableau de bord'!$D$33='Tableau de bord'!M33,4,0)","v":0},null,null,null,null,{"$f":"'OMFG Week'!B19","v":0},{"$f":"'OMFG Week'!G19","v":0}]
[]
[]
[null,null,null,{"$f":"'Cologne 2016'!F2","v":"DOYL"},{"$f":"'Cologne 2016'!G2","v":"EPICIER"},{"$f":"'Cologne 2016'!H2","v":"DARKS"},{"$f":"'Cologne 2016'!I2","v":"KEVNAY"},{"$f":"'Cologne 2016'!J2","v":"NICO"},{"$f":"'Cologne 2016'!K2","v":"BUDO"},{"$f":"'Cologne 2016'!L2","v":"VENTUR"},{"$f":"'Cologne 2016'!M2","v":"MIKEU"},{"$f":"'Cologne 2016'!N2","v":"CPASSIMAL"},{"$f":"'Cologne 2016'!O2","v":"DOUZER"},{"$f":"'Cologne 2016'!P2","v":"PERF"},{"$f":"'Cologne 2016'!Q2","v":0},{"$f":"'Cologne 2016'!R2","v":0},{"$f":"'Cologne 2016'!S2","v":0},{"$f":"'Cologne 2016'!T2","v":0}]
[null,null,"POULES",{"$f":"IF('Cologne 2016'!$E3='Cologne 2016'!F3,3,0)","v":3},{"$f":"IF('Cologne 2016'!$E3='Cologne 2016'!G3,3,0)","v":3},{"$f":"IF('Cologne 2016'!$E3='Cologne 2016'!H3,3,0)","v":3},{"$f":"IF('Cologne 2016'!$E3='Cologne 2016'!I3,3,0)","v":3},{"$f":"IF('Cologne 2016'!$E3='Cologne 2016'!J3,3,0)","v":3},{"$f":"IF('Cologne 2016'!$E3='Cologne 2016'!K3,3,0)","v":3},{"$f":"IF('Cologne 2016'!$E3='Cologne 2016'!L3,3,0)","v":3},{"$f":"IF('Cologne 2016'!$E3='Cologne 2016'!M3,3,0)","v":3},{"$f":"IF('Cologne 2016'!$E3='Cologne 2016'!N3,3,0)","v":3},{"$f":"IF('Cologne 2016'!$E3='Cologne 2016'!O3,3,0)","v":3},{"$f":"IF('Cologne 2016'!$E3='Cologne 2016'!P3,3,0)","v":3},{"$f":"IF('Cologne 2016'!$E3='Cologne 2016'!Q3,3,0)","v":0},{"$f":"IF('Cologne 2016'!$E3='Cologne 2016'!R3,3,0)","v":0},{"$f":"IF('Cologne 2016'!$E3='Cologne 2016'!S3,3,0)","v":0},{"$f":"IF('Cologne 2016'!$E3='Cologne 2016'!T3,3,0)","v":0}]
["Résultats",null,null,{"$f":"IF('Cologne 2016'!$E4='Cologne 2016'!F4,3,0)","v":3},{"$f":"IF('Cologne 2016'!$E4='Cologne 2016'!G4,3,0)","v":0},{"$f":"IF('Cologne 2016'!$E4='Cologne 2016'!H4,3,0)","v":0},{"$f":"IF('Cologne 2016'!$E4='Cologne 2016'!I4,3,0)","v":0},{"$f":"IF('Cologne 2016'!$E4='Cologne 2016'!J4,3,0)","v":0},{"$f":"IF('Cologne 2016'!$E4='Cologne 2016'!K4,3,0)","v":0},{"$f":"IF('Cologne 2016'!$E4='Cologne 2016'!L4,3,0)","v":0},{"$f":"IF('Cologne 2016'!$E4='Cologne 2016'!M4,3,0)","v":3},{"$f":"IF('Cologne 2016'!$E4='Cologne 2016'!N4,3,0)","v":3},{"$f":"IF('Cologne 2016'!$E4='Cologne 2016'!O4,3,0)","v":3},{"$f":"IF('Cologne 2016'!$E4='Cologne 2016'!P4,3,0)","v":0},{"$f":"IF('Cologne 2016'!$E4='Cologne 2016'!Q4,3,0)","v":0},{"$f":"IF('Cologne 2016'!$E4='Cologne 2016'!R4,3,0)","v":0},{"$f":"IF('Cologne 2016'!$E4='Cologne 2016'!S4,3,0)","v":0},{"$f":"IF('Cologne 2016'!$E4='Cologne 2016'!T4,3,0)","v":0}]
["2 - 0","1 - 0",null,{"$f":"IF('Cologne 2016'!$E5='Cologne 2016'!F5,3,0)","v":0},{"$f":"IF('Cologne 2016'!$E5='Cologne 2016'!G5,3,0)","v":0},{"$f":"IF('Cologne 2016'!$E5='Cologne 2016'!H5,3,0)","v":0},{"$f":"IF('Cologne 2016'!$E5='Cologne 2016'!I5,3,0)","v":0},{"$f":"IF('Cologne 2016'!$E5='Cologne 2016'!J5,3,0)","v":0},{"$f":"IF('Cologne 2016'!$E5='Cologne 2016'!K5,3,0)","v":0},{"$f":"IF('Cologne 2016'!$E5='Cologne 2016'!L5,3,0)","v":0},{"$f":"IF('Cologne 2016'!$E5='Cologne 2016'!M5,3,0)","v":0},{"$f":"IF('Cologne 2016'!$E5='Cologne 2016'!N5,3,0)","v":0},{"$f":"IF('Cologne 2016'!$E5='Cologne 2016'!O5,3,0)","v":0},{"$f":"IF('Cologne 2016'!$E5='Cologne 2016'!P5,3,0)","v":0},{"$f":"IF('Cologne 2016'!$E5='Cologne 2016'!Q5,3,0)","v":0},{"$f":"IF('Cologne 2016'!$E5='Cologne 2016'!R5,3,0)","v":0},{"$f":"IF('Cologne 2016'!$E5='Cologne 2016'!S5,3,0)","v":0},{"$f":"IF('Cologne 2016'!$E5='Cologne 2016'!T5,3,0)","v":0}]
["2 - 1","0 - 1",null,{"$f":"IF('Cologne 2016'!$E6='Cologne 2016'!F6,3,0)","v":3},{"$f":"IF('Cologne 2016'!$E6='Cologne 2016'!G6,3,0)","v":0},{"$f":"IF('Cologne 2016'!$E6='Cologne 2016'!H6,3,0)","v":0},{"$f":"IF('Cologne 2016'!$E6='Cologne 2016'!I6,3,0)","v":3},{"$f":"IF('Cologne 2016'!$E6='Cologne 2016'!J6,3,0)","v":0},{"$f":"IF('Cologne 2016'!$E6='Cologne 2016'!K6,3,0)","v":3},{"$f":"IF('Cologne 2016'!$E6='Cologne 2016'!L6,3,0)","v":3},{"$f":"IF('Cologne 2016'!$E6='Cologne 2016'!M6,3,0)","v":3},{"$f":"IF('Cologne 2016'!$E6='Cologne 2016'!N6,3,0)","v":0},{"$f":"IF('Cologne 2016'!$E6='Cologne 2016'!O6,3,0)","v":3},{"$f":"IF('Cologne 2016'!$E6='Cologne 2016'!P6,3,0)","v":3},{"$f":"IF('Cologne 2016'!$E6='Cologne 2016'!Q6,3,0)","v":0},{"$f":"IF('Cologne 2016'!$E6='Cologne 2016'!R6,3,0)","v":0},{"$f":"IF('Cologne 2016'!$E6='Cologne 2016'!S6,3,0)","v":0},{"$f":"IF('Cologne 2016'!$E6='Cologne 2016'!T6,3,0)","v":0}]
["1 - 2","0 - 0",null,{"$f":"IF('Cologne 2016'!$E7='Cologne 2016'!F7,4,IF(OR(LEFT('Cologne 2016'!$E7,1)=LEFT('Cologne 2016'!F7,1),RIGHT('Cologne 2016'!$E7,1)=RIGHT('Cologne 2016'!F7,1)),3,0))","v":4},{"$f":"IF('Cologne 2016'!$E7='Cologne 2016'!G7,4,IF(OR(LEFT('Cologne 2016'!$E7,1)=LEFT('Cologne 2016'!G7,1),RIGHT('Cologne 2016'!$E7,1)=RIGHT('Cologne 2016'!G7,1)),3,0))","v":0},{"$f":"IF('Cologne 2016'!$E7='Cologne 2016'!H7,4,IF(OR(LEFT('Cologne 2016'!$E7,1)=LEFT('Cologne 2016'!H7,1),RIGHT('Cologne 2016'!$E7,1)=RIGHT('Cologne 2016'!H7,1)),3,0))","v":4},{"$f":"IF('Cologne 2016'!$E7='Cologne 2016'!I7,4,IF(OR(LEFT('Cologne 2016'!$E7,1)=LEFT('Cologne 2016'!I7,1),RIGHT('Cologne 2016'!$E7,1)=RIGHT('Cologne 2016'!I7,1)),3,0))","v":4},{"$f":"IF('Cologne 2016'!$E7='Cologne 2016'!J7,4,IF(OR(LEFT('Cologne 2016'!$E7,1)=LEFT('Cologne 2016'!J7,1),RIGHT('Cologne 2016'!$E7,1)=RIGHT('Cologne 2016'!J7,1)),3,0))","v":4},{"$f":"IF('Cologne 2016'!$E7='Cologne 2016'!K7,4,IF(OR(LEFT('Cologne 2016'!$E7,1)=LEFT('Cologne 2016'!K7,1),RIGHT('Cologne 2016'!$E7,1)=RIGHT('Cologne 2016'!K7,1)),3,0))","v":0},{"$f":"IF('Cologne 2016'!$E7='Cologne 2016'!L7,4,IF(OR(LEFT('Cologne 2016'!$E7,1)=LEFT('Cologne 2016'!L7,1),RIGHT('Cologne 2016'!$E7,1)=RIGHT('Cologne 2016'!L7,1)),3,0))","v":3},{"$f":"IF('Cologne 2016'!$E7='Cologne 2016'!M7,4,IF(OR(LEFT('Cologne 2016'!$E7,1)=LEFT('Cologne 2016'!M7,1),RIGHT('Cologne 2016'!$E7,1)=RIGHT('Cologne 2016'!M7,1)),3,0))","v":3},{"$f":"IF('Cologne 2016'!$E7='Cologne 2016'!N7,4,IF(OR(LEFT('Cologne 2016'!$E7,1)=LEFT('Cologne 2016'!N7,1),RIGHT('Cologne 2016'!$E7,1)=RIGHT('Cologne 2016'!N7,1)),3,0))","v":4},{"$f":"IF('Cologne 2016'!$E7='Cologne 2016'!O7,4,IF(OR(LEFT('Cologne 2016'!$E7,1)=LEFT('Cologne 2016'!O7,1),RIGHT('Cologne 2016'!$E7,1)=RIGHT('Cologne 2016'!O7,1)),3,0))","v":0},{"$f":"IF('Cologne 2016'!$E7='Cologne 2016'!P7,4,IF(OR(LEFT('Cologne 2016'!$E7,1)=LEFT('Cologne 2016'!P7,1),RIGHT('Cologne 2016'!$E7,1)=RIGHT('Cologne 2016'!P7,1)),3,0))","v":0},{"$f":"IF('Cologne 2016'!$E7='Cologne 2016'!Q7,4,IF(OR(LEFT('Cologne 2016'!$E7,1)=LEFT('Cologne 2016'!Q7,1),RIGHT('Cologne 2016'!$E7,1)=RIGHT('Cologne 2016'!Q7,1)),3,0))","v":0},{"$f":"IF('Cologne 2016'!$E7='Cologne 2016'!R7,4,IF(OR(LEFT('Cologne 2016'!$E7,1)=LEFT('Cologne 2016'!R7,1),RIGHT('Cologne 2016'!$E7,1)=RIGHT('Cologne 2016'!R7,1)),3,0))","v":0},{"$f":"IF('Cologne 2016'!$E7='Cologne 2016'!S7,4,IF(OR(LEFT('Cologne 2016'!$E7,1)=LEFT('Cologne 2016'!S7,1),RIGHT('Cologne 2016'!$E7,1)=RIGHT('Cologne 2016'!S7,1)),3,0))","v":0},{"$f":"IF('Cologne 2016'!$E7='Cologne 2016'!T7,4,IF(OR(LEFT('Cologne 2016'!$E7,1)=LEFT('Cologne 2016'!T7,1),RIGHT('Cologne 2016'!$E7,1)=RIGHT('Cologne 2016'!T7,1)),3,0))","v":0}]
["0 - 2",null,null,{"$f":"IF('Cologne 2016'!$E8='Cologne 2016'!F8,3,0)","v":3},{"$f":"IF('Cologne 2016'!$E8='Cologne 2016'!G8,3,0)","v":0},{"$f":"IF('Cologne 2016'!$E8='Cologne 2016'!H8,3,0)","v":3},{"$f":"IF('Cologne 2016'!$E8='Cologne 2016'!I8,3,0)","v":3},{"$f":"IF('Cologne 2016'!$E8='Cologne 2016'!J8,3,0)","v":3},{"$f":"IF('Cologne 2016'!$E8='Cologne 2016'!K8,3,0)","v":3},{"$f":"IF('Cologne 2016'!$E8='Cologne 2016'!L8,3,0)","v":3},{"$f":"IF('Cologne 2016'!$E8='Cologne 2016'!M8,3,0)","v":3},{"$f":"IF('Cologne 2016'!$E8='Cologne 2016'!N8,3,0)","v":3},{"$f":"IF('Cologne 2016'!$E8='Cologne 2016'!O8,3,0)","v":3},{"$f":"IF('Cologne 2016'!$E8='Cologne 2016'!P8,3,0)","v":3},{"$f":"IF('Cologne 2016'!$E8='Cologne 2016'!Q8,3,0)","v":0},{"$f":"IF('Cologne 2016'!$E8='Cologne 2016'!R8,3,0)","v":0},{"$f":"IF('Cologne 2016'!$E8='Cologne 2016'!S8,3,0)","v":0},{"$f":"IF('Cologne 2016'!$E8='Cologne 2016'!T8,3,0)","v":0}]
["0 - 0",null,null,{"$f":"IF('Cologne 2016'!$E9='Cologne 2016'!F9,3,0)","v":3},{"$f":"IF('Cologne 2016'!$E9='Cologne 2016'!G9,3,0)","v":3},{"$f":"IF('Cologne 2016'!$E9='Cologne 2016'!H9,3,0)","v":0},{"$f":"IF('Cologne 2016'!$E9='Cologne 2016'!I9,3,0)","v":3},{"$f":"IF('Cologne 2016'!$E9='Cologne 2016'!J9,3,0)","v":3},{"$f":"IF('Cologne 2016'!$E9='Cologne 2016'!K9,3,0)","v":3},{"$f":"IF('Cologne 2016'!$E9='Cologne 2016'!L9,3,0)","v":3},{"$f":"IF('Cologne 2016'!$E9='Cologne 2016'!M9,3,0)","v":3},{"$f":"IF('Cologne 2016'!$E9='Cologne 2016'!N9,3,0)","v":3},{"$f":"IF('Cologne 2016'!$E9='Cologne 2016'!O9,3,0)","v":3},{"$f":"IF('Cologne 2016'!$E9='Cologne 2016'!P9,3,0)","v":3},{"$f":"IF('Cologne 2016'!$E9='Cologne 2016'!Q9,3,0)","v":0},{"$f":"IF('Cologne 2016'!$E9='Cologne 2016'!R9,3,0)","v":0},{"$f":"IF('Cologne 2016'!$E9='Cologne 2016'!S9,3,0)","v":0},{"$f":"IF('Cologne 2016'!$E9='Cologne 2016'!T9,3,0)","v":0}]
[null,null,null,{"$f":"IF('Cologne 2016'!$E10='Cologne 2016'!F10,3,0)","v":0},{"$f":"IF('Cologne 2016'!$E10='Cologne 2016'!G10,3,0)","v":3},{"$f":"IF('Cologne 2016'!$E10='Cologne 2016'!H10,3,0)","v":3},{"$f":"IF('Cologne 2016'!$E10='Cologne 2016'!I10,3,0)","v":3},{"$f":"IF('Cologne 2016'!$E10='Cologne 2016'!J10,3,0)","v":0},{"$f":"IF('Cologne 2016'!$E10='Cologne 2016'!K10,3,0)","v":0},{"$f":"IF('Cologne 2016'!$E10='Cologne 2016'!L10,3,0)","v":0},{"$f":"IF('Cologne 2016'!$E10='Cologne 2016'!M10,3,0)","v":0},{"$f":"IF('Cologne 2016'!$E10='Cologne 2016'!N10,3,0)","v":3},{"$f":"IF('Cologne 2016'!$E10='Cologne 2016'!O10,3,0)","v":3},{"$f":"IF('Cologne 2016'!$E10='Cologne 2016'!P10,3,0)","v":3},{"$f":"IF('Cologne 2016'!$E10='Cologne 2016'!Q10,3,0)","v":0},{"$f":"IF('Cologne 2016'!$E10='Cologne 2016'!R10,3,0)","v":0},{"$f":"IF('Cologne 2016'!$E10='Cologne 2016'!S10,3,0)","v":0},{"$f":"IF('Cologne 2016'!$E10='Cologne 2016'!T10,3,0)","v":0}]
[null,null,null,{"$f":"IF('Cologne 2016'!$E11='Cologne 2016'!F11,3,0)","v":3},{"$f":"IF('Cologne 2016'!$E11='Cologne 2016'!G11,3,0)","v":3},{"$f":"IF('Cologne 2016'!$E11='Cologne 2016'!H11,3,0)","v":0},{"$f":"IF('Cologne 2016'!$E11='Cologne 2016'!I11,3,0)","v":3},{"$f":"IF('Cologne 2016'!$E11='Cologne 2016'!J11,3,0)","v":0},{"$f":"IF('Cologne 2016'!$E11='Cologne 2016'!K11,3,0)","v":0},{"$f":"IF('Cologne 2016'!$E11='Cologne 2016'!L11,3,0)","v":0},{"$f":"IF('Cologne 2016'!$E11='Cologne 2016'!M11,3,0)","v":3},{"$f":"IF('Cologne 2016'!$E11='Cologne 2016'!N11,3,0)","v":3},{"$f":"IF('Cologne 2016'!$E11='Cologne 2016'!O11,3,0)","v":3},{"$f":"IF('Cologne 2016'!$E11='Cologne 2016'!P11,3,0)","v":3},{"$f":"IF('Cologne 2016'!$E11='Cologne 2016'!Q11,3,0)","v":0},{"$f":"IF('Cologne 2016'!$E11='Cologne 2016'!R11,3,0)","v":0},{"$f":"IF('Cologne 2016'!$E11='Cologne 2016'!S11,3,0)","v":0},{"$f":"IF('Cologne 2016'!$E11='Cologne 2016'!T11,3,0)","v":0}]
[null,null,null,{"$f":"IF('Cologne 2016'!$E12='Cologne 2016'!F12,4,IF(OR(LEFT('Cologne 2016'!$E12,1)=LEFT('Cologne 2016'!F12,1),RIGHT('Cologne 2016'!$E12,1)=RIGHT('Cologne 2016'!F12,1)),3,0))","v":0},{"$f":"IF('Cologne 2016'!$E12='Cologne 2016'!G12,4,IF(OR(LEFT('Cologne 2016'!$E12,1)=LEFT('Cologne 2016'!G12,1),RIGHT('Cologne 2016'!$E12,1)=RIGHT('Cologne 2016'!G12,1)),3,0))","v":0},{"$f":"IF('Cologne 2016'!$E12='Cologne 2016'!H12,4,IF(OR(LEFT('Cologne 2016'!$E12,1)=LEFT('Cologne 2016'!H12,1),RIGHT('Cologne 2016'!$E12,1)=RIGHT('Cologne 2016'!H12,1)),3,0))","v":0},{"$f":"IF('Cologne 2016'!$E12='Cologne 2016'!I12,4,IF(OR(LEFT('Cologne 2016'!$E12,1)=LEFT('Cologne 2016'!I12,1),RIGHT('Cologne 2016'!$E12,1)=RIGHT('Cologne 2016'!I12,1)),3,0))","v":0},{"$f":"IF('Cologne 2016'!$E12='Cologne 2016'!J12,4,IF(OR(LEFT('Cologne 2016'!$E12,1)=LEFT('Cologne 2016'!J12,1),RIGHT('Cologne 2016'!$E12,1)=RIGHT('Cologne 2016'!J12,1)),3,0))","v":0},{"$f":"IF('Cologne 2016'!$E12='Cologne 2016'!K12,4,IF(OR(LEFT('Cologne 2016'!$E12,1)=LEFT('Cologne 2016'!K12,1),RIGHT('Cologne 2016'!$E12,1)=RIGHT('Cologne 2016'!K12,1)),3,0))","v":0},{"$f":"IF('Cologne 2016'!$E12='Cologne 2016'!L12,4,IF(OR(LEFT('Cologne 2016'!$E12,1)=LEFT('Cologne 2016'!L12,1),RIGHT('Cologne 2016'!$E12,1)=RIGHT('Cologne 2016'!L12,1)),3,0))","v":0},{"$f":"IF('Cologne 2016'!$E12='Cologne 2016'!M12,4,IF(OR(LEFT('Cologne 2016'!$E12,1)=LEFT('Cologne 2016'!M12,1),RIGHT('Cologne 2016'!$E12,1)=RIGHT('Cologne 2016'!M12,1)),3,0))","v":0},{"$f":"IF('Cologne 2016'!$E12='Cologne 2016'!N12,4,IF(OR(LEFT('Cologne 2016'!$E12,1)=LEFT('Cologne 2016'!N12,1),RIGHT('Cologne 2016'!$E12,1)=RIGHT('Cologne 2016'!N12,1)),3,0))","v":0},{"$f":"IF('Cologne 2016'!$E12='Cologne 2016'!O12,4,IF(OR(LEFT('Cologne 2016'!$E12,1)=LEFT('Cologne 2016'!O12,1),RIGHT('Cologne 2016'!$E12,1)=RIGHT('Cologne 2016'!O12,1)),3,0))","v":0},{"$f":"IF('Cologne 2016'!$E12='Cologne 2016'!P12,4,IF(OR(LEFT('Cologne 2016'!$E12,1)=LEFT('Cologne 2016'!P12,1),RIGHT('Cologne 2016'!$E12,1)=RIGHT('Cologne 2016'!P12,1)),3,0))","v":0},{"$f":"IF('Cologne 2016'!$E12='Cologne 2016'!Q12,4,IF(OR(LEFT('Cologne 2016'!$E12,1)=LEFT('Cologne 2016'!Q12,1),RIGHT('Cologne 2016'!$E12,1)=RIGHT('Cologne 2016'!Q12,1)),3,0))","v":0},{"$f":"IF('Cologne 2016'!$E12='Cologne 2016'!R12,4,IF(OR(LEFT('Cologne 2016'!$E12,1)=LEFT('Cologne 2016'!R12,1),RIGHT('Cologne 2016'!$E12,1)=RIGHT('Cologne 2016'!R12,1)),3,0))","v":0},{"$f":"IF('Cologne 2016'!$E12='Cologne 2016'!S12,4,IF(OR(LEFT('Cologne 2016'!$E12,1)=LEFT('Cologne 2016'!S12,1),RIGHT('Cologne 2016'!$E12,1)=RIGHT('Cologne 2016'!S12,1)),3,0))","v":0},{"$f":"IF('Cologne 2016'!$E12='Cologne 2016'!T12,4,IF(OR(LEFT('Cologne 2016'!$E12,1)=LEFT('Cologne 2016'!T12,1),RIGHT('Cologne 2016'!$E12,1)=RIGHT('Cologne 2016'!T12,1)),3,0))","v":0}]
["Astralis",null,null,{"$f":"IF('Cologne 2016'!$E13='Cologne 2016'!F13,3,0)","v":3},{"$f":"IF('Cologne 2016'!$E13='Cologne 2016'!G13,3,0)","v":0},{"$f":"IF('Cologne 2016'!$E13='Cologne 2016'!H13,3,0)","v":0},{"$f":"IF('Cologne 2016'!$E13='Cologne 2016'!I13,3,0)","v":3},{"$f":"IF('Cologne 2016'!$E13='Cologne 2016'!J13,3,0)","v":0},{"$f":"IF('Cologne 2016'!$E13='Cologne 2016'!K13,3,0)","v":3},{"$f":"IF('Cologne 2016'!$E13='Cologne 2016'!L13,3,0)","v":3},{"$f":"IF('Cologne 2016'!$E13='Cologne 2016'!M13,3,0)","v":3},{"$f":"IF('Cologne 2016'!$E13='Cologne 2016'!N13,3,0)","v":3},{"$f":"IF('Cologne 2016'!$E13='Cologne 2016'!O13,3,0)","v":0},{"$f":"IF('Cologne 2016'!$E13='Cologne 2016'!P13,3,0)","v":3},{"$f":"IF('Cologne 2016'!$E13='Cologne 2016'!Q13,3,0)","v":0},{"$f":"IF('Cologne 2016'!$E13='Cologne 2016'!R13,3,0)","v":0},{"$f":"IF('Cologne 2016'!$E13='Cologne 2016'!S13,3,0)","v":0},{"$f":"IF('Cologne 2016'!$E13='Cologne 2016'!T13,3,0)","v":0}]
["CLG",null,null,{"$f":"IF('Cologne 2016'!$E14='Cologne 2016'!F14,3,0)","v":3},{"$f":"IF('Cologne 2016'!$E14='Cologne 2016'!G14,3,0)","v":0},{"$f":"IF('Cologne 2016'!$E14='Cologne 2016'!H14,3,0)","v":3},{"$f":"IF('Cologne 2016'!$E14='Cologne 2016'!I14,3,0)","v":0},{"$f":"IF('Cologne 2016'!$E14='Cologne 2016'!J14,3,0)","v":0},{"$f":"IF('Cologne 2016'!$E14='Cologne 2016'!K14,3,0)","v":0},{"$f":"IF('Cologne 2016'!$E14='Cologne 2016'!L14,3,0)","v":0},{"$f":"IF('Cologne 2016'!$E14='Cologne 2016'!M14,3,0)","v":3},{"$f":"IF('Cologne 2016'!$E14='Cologne 2016'!N14,3,0)","v":3},{"$f":"IF('Cologne 2016'!$E14='Cologne 2016'!O14,3,0)","v":3},{"$f":"IF('Cologne 2016'!$E14='Cologne 2016'!P14,3,0)","v":0},{"$f":"IF('Cologne 2016'!$E14='Cologne 2016'!Q14,3,0)","v":0},{"$f":"IF('Cologne 2016'!$E14='Cologne 2016'!R14,3,0)","v":0},{"$f":"IF('Cologne 2016'!$E14='Cologne 2016'!S14,3,0)","v":0},{"$f":"IF('Cologne 2016'!$E14='Cologne 2016'!T14,3,0)","v":0}]
["Gambit",null,null,{"$f":"IF('Cologne 2016'!$E15='Cologne 2016'!F15,3,0)","v":3},{"$f":"IF('Cologne 2016'!$E15='Cologne 2016'!G15,3,0)","v":0},{"$f":"IF('Cologne 2016'!$E15='Cologne 2016'!H15,3,0)","v":0},{"$f":"IF('Cologne 2016'!$E15='Cologne 2016'!I15,3,0)","v":0},{"$f":"IF('Cologne 2016'!$E15='Cologne 2016'!J15,3,0)","v":3},{"$f":"IF('Cologne 2016'!$E15='Cologne 2016'!K15,3,0)","v":0},{"$f":"IF('Cologne 2016'!$E15='Cologne 2016'!L15,3,0)","v":0},{"$f":"IF('Cologne 2016'!$E15='Cologne 2016'!M15,3,0)","v":0},{"$f":"IF('Cologne 2016'!$E15='Cologne 2016'!N15,3,0)","v":0},{"$f":"IF('Cologne 2016'!$E15='Cologne 2016'!O15,3,0)","v":3},{"$f":"IF('Cologne 2016'!$E15='Cologne 2016'!P15,3,0)","v":0},{"$f":"IF('Cologne 2016'!$E15='Cologne 2016'!Q15,3,0)","v":0},{"$f":"IF('Cologne 2016'!$E15='Cologne 2016'!R15,3,0)","v":0},{"$f":"IF('Cologne 2016'!$E15='Cologne 2016'!S15,3,0)","v":0},{"$f":"IF('Cologne 2016'!$E15='Cologne 2016'!T15,3,0)","v":0}]
["dignitas",null,null,{"$f":"IF('Cologne 2016'!$E16='Cologne 2016'!F16,3,0)","v":3},{"$f":"IF('Cologne 2016'!$E16='Cologne 2016'!G16,3,0)","v":3},{"$f":"IF('Cologne 2016'!$E16='Cologne 2016'!H16,3,0)","v":3},{"$f":"IF('Cologne 2016'!$E16='Cologne 2016'!I16,3,0)","v":3},{"$f":"IF('Cologne 2016'!$E16='Cologne 2016'!J16,3,0)","v":0},{"$f":"IF('Cologne 2016'!$E16='Cologne 2016'!K16,3,0)","v":3},{"$f":"IF('Cologne 2016'!$E16='Cologne 2016'!L16,3,0)","v":3},{"$f":"IF('Cologne 2016'!$E16='Cologne 2016'!M16,3,0)","v":3},{"$f":"IF('Cologne 2016'!$E16='Cologne 2016'!N16,3,0)","v":3},{"$f":"IF('Cologne 2016'!$E16='Cologne 2016'!O16,3,0)","v":3},{"$f":"IF('Cologne 2016'!$E16='Cologne 2016'!P16,3,0)","v":3},{"$f":"IF('Cologne 2016'!$E16='Cologne 2016'!Q16,3,0)","v":0},{"$f":"IF('Cologne 2016'!$E16='Cologne 2016'!R16,3,0)","v":0},{"$f":"IF('Cologne 2016'!$E16='Cologne 2016'!S16,3,0)","v":0},{"$f":"IF('Cologne 2016'!$E16='Cologne 2016'!T16,3,0)","v":0}]
["NaVi",null,null,{"$f":"IF('Cologne 2016'!$E17='Cologne 2016'!F17,4,IF(OR(LEFT('Cologne 2016'!$E17,1)=LEFT('Cologne 2016'!F17,1),RIGHT('Cologne 2016'!$E17,1)=RIGHT('Cologne 2016'!F17,1)),3,0))","v":4},{"$f":"IF('Cologne 2016'!$E17='Cologne 2016'!G17,4,IF(OR(LEFT('Cologne 2016'!$E17,1)=LEFT('Cologne 2016'!G17,1),RIGHT('Cologne 2016'!$E17,1)=RIGHT('Cologne 2016'!G17,1)),3,0))","v":0},{"$f":"IF('Cologne 2016'!$E17='Cologne 2016'!H17,4,IF(OR(LEFT('Cologne 2016'!$E17,1)=LEFT('Cologne 2016'!H17,1),RIGHT('Cologne 2016'!$E17,1)=RIGHT('Cologne 2016'!H17,1)),3,0))","v":3},{"$f":"IF('Cologne 2016'!$E17='Cologne 2016'!I17,4,IF(OR(LEFT('Cologne 2016'!$E17,1)=LEFT('Cologne 2016'!I17,1),RIGHT('Cologne 2016'!$E17,1)=RIGHT('Cologne 2016'!I17,1)),3,0))","v":3},{"$f":"IF('Cologne 2016'!$E17='Cologne 2016'!J17,4,IF(OR(LEFT('Cologne 2016'!$E17,1)=LEFT('Cologne 2016'!J17,1),RIGHT('Cologne 2016'!$E17,1)=RIGHT('Cologne 2016'!J17,1)),3,0))","v":0},{"$f":"IF('Cologne 2016'!$E17='Cologne 2016'!K17,4,IF(OR(LEFT('Cologne 2016'!$E17,1)=LEFT('Cologne 2016'!K17,1),RIGHT('Cologne 2016'!$E17,1)=RIGHT('Cologne 2016'!K17,1)),3,0))","v":0},{"$f":"IF('Cologne 2016'!$E17='Cologne 2016'!L17,4,IF(OR(LEFT('Cologne 2016'!$E17,1)=LEFT('Cologne 2016'!L17,1),RIGHT('Cologne 2016'!$E17,1)=RIGHT('Cologne 2016'!L17,1)),3,0))","v":3},{"$f":"IF('Cologne 2016'!$E17='Cologne 2016'!M17,4,IF(OR(LEFT('Cologne 2016'!$E17,1)=LEFT('Cologne 2016'!M17,1),RIGHT('Cologne 2016'!$E17,1)=RIGHT('Cologne 2016'!M17,1)),3,0))","v":3},{"$f":"IF('Cologne 2016'!$E17='Cologne 2016'!N17,4,IF(OR(LEFT('Cologne 2016'!$E17,1)=LEFT('Cologne 2016'!N17,1),RIGHT('Cologne 2016'!$E17,1)=RIGHT('Cologne 2016'!N17,1)),3,0))","v":0},{"$f":"IF('Cologne 2016'!$E17='Cologne 2016'!O17,4,IF(OR(LEFT('Cologne 2016'!$E17,1)=LEFT('Cologne 2016'!O17,1),RIGHT('Cologne 2016'!$E17,1)=RIGHT('Cologne 2016'!O17,1)),3,0))","v":3},{"$f":"IF('Cologne 2016'!$E17='Cologne 2016'!P17,4,IF(OR(LEFT('Cologne 2016'!$E17,1)=LEFT('Cologne 2016'!P17,1),RIGHT('Cologne 2016'!$E17,1)=RIGHT('Cologne 2016'!P17,1)),3,0))","v":3},{"$f":"IF('Cologne 2016'!$E17='Cologne 2016'!Q17,4,IF(OR(LEFT('Cologne 2016'!$E17,1)=LEFT('Cologne 2016'!Q17,1),RIGHT('Cologne 2016'!$E17,1)=RIGHT('Cologne 2016'!Q17,1)),3,0))","v":0},{"$f":"IF('Cologne 2016'!$E17='Cologne 2016'!R17,4,IF(OR(LEFT('Cologne 2016'!$E17,1)=LEFT('Cologne 2016'!R17,1),RIGHT('Cologne 2016'!$E17,1)=RIGHT('Cologne 2016'!R17,1)),3,0))","v":0},{"$f":"IF('Cologne 2016'!$E17='Cologne 2016'!S17,4,IF(OR(LEFT('Cologne 2016'!$E17,1)=LEFT('Cologne 2016'!S17,1),RIGHT('Cologne 2016'!$E17,1)=RIGHT('Cologne 2016'!S17,1)),3,0))","v":0},{"$f":"IF('Cologne 2016'!$E17='Cologne 2016'!T17,4,IF(OR(LEFT('Cologne 2016'!$E17,1)=LEFT('Cologne 2016'!T17,1),RIGHT('Cologne 2016'!$E17,1)=RIGHT('Cologne 2016'!T17,1)),3,0))","v":0}]
["NiP",null,null,{"$f":"IF('Cologne 2016'!$E18='Cologne 2016'!F18,3,0)","v":0},{"$f":"IF('Cologne 2016'!$E18='Cologne 2016'!G18,3,0)","v":0},{"$f":"IF('Cologne 2016'!$E18='Cologne 2016'!H18,3,0)","v":0},{"$f":"IF('Cologne 2016'!$E18='Cologne 2016'!I18,3,0)","v":3},{"$f":"IF('Cologne 2016'!$E18='Cologne 2016'!J18,3,0)","v":3},{"$f":"IF('Cologne 2016'!$E18='Cologne 2016'!K18,3,0)","v":3},{"$f":"IF('Cologne 2016'!$E18='Cologne 2016'!L18,3,0)","v":3},{"$f":"IF('Cologne 2016'!$E18='Cologne 2016'!M18,3,0)","v":0},{"$f":"IF('Cologne 2016'!$E18='Cologne 2016'!N18,3,0)","v":0},{"$f":"IF('Cologne 2016'!$E18='Cologne 2016'!O18,3,0)","v":3},{"$f":"IF('Cologne 2016'!$E18='Cologne 2016'!P18,3,0)","v":0},{"$f":"IF('Cologne 2016'!$E18='Cologne 2016'!Q18,3,0)","v":0},{"$f":"IF('Cologne 2016'!$E18='Cologne 2016'!R18,3,0)","v":0},{"$f":"IF('Cologne 2016'!$E18='Cologne 2016'!S18,3,0)","v":0},{"$f":"IF('Cologne 2016'!$E18='Cologne 2016'!T18,3,0)","v":0}]
["OpTic",null,null,{"$f":"IF('Cologne 2016'!$E19='Cologne 2016'!F19,3,0)","v":0},{"$f":"IF('Cologne 2016'!$E19='Cologne 2016'!G19,3,0)","v":0},{"$f":"IF('Cologne 2016'!$E19='Cologne 2016'!H19,3,0)","v":3},{"$f":"IF('Cologne 2016'!$E19='Cologne 2016'!I19,3,0)","v":0},{"$f":"IF('Cologne 2016'!$E19='Cologne 2016'!J19,3,0)","v":0},{"$f":"IF('Cologne 2016'!$E19='Cologne 2016'!K19,3,0)","v":0},{"$f":"IF('Cologne 2016'!$E19='Cologne 2016'!L19,3,0)","v":0},{"$f":"IF('Cologne 2016'!$E19='Cologne 2016'!M19,3,0)","v":0},{"$f":"IF('Cologne 2016'!$E19='Cologne 2016'!N19,3,0)","v":0},{"$f":"IF('Cologne 2016'!$E19='Cologne 2016'!O19,3,0)","v":0},{"$f":"IF('Cologne 2016'!$E19='Cologne 2016'!P19,3,0)","v":0},{"$f":"IF('Cologne 2016'!$E19='Cologne 2016'!Q19,3,0)","v":0},{"$f":"IF('Cologne 2016'!$E19='Cologne 2016'!R19,3,0)","v":0},{"$f":"IF('Cologne 2016'!$E19='Cologne 2016'!S19,3,0)","v":0},{"$f":"IF('Cologne 2016'!$E19='Cologne 2016'!T19,3,0)","v":0}]
["Flipside",null,null,{"$f":"IF('Cologne 2016'!$E20='Cologne 2016'!F20,3,0)","v":0},{"$f":"IF('Cologne 2016'!$E20='Cologne 2016'!G20,3,0)","v":3},{"$f":"IF('Cologne 2016'!$E20='Cologne 2016'!H20,3,0)","v":0},{"$f":"IF('Cologne 2016'!$E20='Cologne 2016'!I20,3,0)","v":3},{"$f":"IF('Cologne 2016'!$E20='Cologne 2016'!J20,3,0)","v":3},{"$f":"IF('Cologne 2016'!$E20='Cologne 2016'!K20,3,0)","v":3},{"$f":"IF('Cologne 2016'!$E20='Cologne 2016'!L20,3,0)","v":3},{"$f":"IF('Cologne 2016'!$E20='Cologne 2016'!M20,3,0)","v":3},{"$f":"IF('Cologne 2016'!$E20='Cologne 2016'!N20,3,0)","v":3},{"$f":"IF('Cologne 2016'!$E20='Cologne 2016'!O20,3,0)","v":3},{"$f":"IF('Cologne 2016'!$E20='Cologne 2016'!P20,3,0)","v":0},{"$f":"IF('Cologne 2016'!$E20='Cologne 2016'!Q20,3,0)","v":0},{"$f":"IF('Cologne 2016'!$E20='Cologne 2016'!R20,3,0)","v":0},{"$f":"IF('Cologne 2016'!$E20='Cologne 2016'!S20,3,0)","v":0},{"$f":"IF('Cologne 2016'!$E20='Cologne 2016'!T20,3,0)","v":0}]
["Liquid",null,null,{"$f":"IF('Cologne 2016'!$E21='Cologne 2016'!F21,3,0)","v":3},{"$f":"IF('Cologne 2016'!$E21='Cologne 2016'!G21,3,0)","v":0},{"$f":"IF('Cologne 2016'!$E21='Cologne 2016'!H21,3,0)","v":3},{"$f":"IF('Cologne 2016'!$E21='Cologne 2016'!I21,3,0)","v":0},{"$f":"IF('Cologne 2016'!$E21='Cologne 2016'!J21,3,0)","v":3},{"$f":"IF('Cologne 2016'!$E21='Cologne 2016'!K21,3,0)","v":3},{"$f":"IF('Cologne 2016'!$E21='Cologne 2016'!L21,3,0)","v":3},{"$f":"IF('Cologne 2016'!$E21='Cologne 2016'!M21,3,0)","v":3},{"$f":"IF('Cologne 2016'!$E21='Cologne 2016'!N21,3,0)","v":3},{"$f":"IF('Cologne 2016'!$E21='Cologne 2016'!O21,3,0)","v":0},{"$f":"IF('Cologne 2016'!$E21='Cologne 2016'!P21,3,0)","v":0},{"$f":"IF('Cologne 2016'!$E21='Cologne 2016'!Q21,3,0)","v":0},{"$f":"IF('Cologne 2016'!$E21='Cologne 2016'!R21,3,0)","v":0},{"$f":"IF('Cologne 2016'!$E21='Cologne 2016'!S21,3,0)","v":0},{"$f":"IF('Cologne 2016'!$E21='Cologne 2016'!T21,3,0)","v":0}]
["VP",null,null,{"$f":"IF('Cologne 2016'!$E22='Cologne 2016'!F22,4,IF(OR(LEFT('Cologne 2016'!$E22,1)=LEFT('Cologne 2016'!F22,1),RIGHT('Cologne 2016'!$E22,1)=RIGHT('Cologne 2016'!F22,1)),3,0))","v":0},{"$f":"IF('Cologne 2016'!$E22='Cologne 2016'!G22,4,IF(OR(LEFT('Cologne 2016'!$E22,1)=LEFT('Cologne 2016'!G22,1),RIGHT('Cologne 2016'!$E22,1)=RIGHT('Cologne 2016'!G22,1)),3,0))","v":0},{"$f":"IF('Cologne 2016'!$E22='Cologne 2016'!H22,4,IF(OR(LEFT('Cologne 2016'!$E22,1)=LEFT('Cologne 2016'!H22,1),RIGHT('Cologne 2016'!$E22,1)=RIGHT('Cologne 2016'!H22,1)),3,0))","v":3},{"$f":"IF('Cologne 2016'!$E22='Cologne 2016'!I22,4,IF(OR(LEFT('Cologne 2016'!$E22,1)=LEFT('Cologne 2016'!I22,1),RIGHT('Cologne 2016'!$E22,1)=RIGHT('Cologne 2016'!I22,1)),3,0))","v":4},{"$f":"IF('Cologne 2016'!$E22='Cologne 2016'!J22,4,IF(OR(LEFT('Cologne 2016'!$E22,1)=LEFT('Cologne 2016'!J22,1),RIGHT('Cologne 2016'!$E22,1)=RIGHT('Cologne 2016'!J22,1)),3,0))","v":3},{"$f":"IF('Cologne 2016'!$E22='Cologne 2016'!K22,4,IF(OR(LEFT('Cologne 2016'!$E22,1)=LEFT('Cologne 2016'!K22,1),RIGHT('Cologne 2016'!$E22,1)=RIGHT('Cologne 2016'!K22,1)),3,0))","v":0},{"$f":"IF('Cologne 2016'!$E22='Cologne 2016'!L22,4,IF(OR(LEFT('Cologne 2016'!$E22,1)=LEFT('Cologne 2016'!L22,1),RIGHT('Cologne 2016'!$E22,1)=RIGHT('Cologne 2016'!L22,1)),3,0))","v":3},{"$f":"IF('Cologne 2016'!$E22='Cologne 2016'!M22,4,IF(OR(LEFT('Cologne 2016'!$E22,1)=LEFT('Cologne 2016'!M22,1),RIGHT('Cologne 2016'!$E22,1)=RIGHT('Cologne 2016'!M22,1)),3,0))","v":0},{"$f":"IF('Cologne 2016'!$E22='Cologne 2016'!N22,4,IF(OR(LEFT('Cologne 2016'!$E22,1)=LEFT('Cologne 2016'!N22,1),RIGHT('Cologne 2016'!$E22,1)=RIGHT('Cologne 2016'!N22,1)),3,0))","v":3},{"$f":"IF('Cologne 2016'!$E22='Cologne 2016'!O22,4,IF(OR(LEFT('Cologne 2016'!$E22,1)=LEFT('Cologne 2016'!O22,1),RIGHT('Cologne 2016'!$E22,1)=RIGHT('Cologne 2016'!O22,1)),3,0))","v":3},{"$f":"IF('Cologne 2016'!$E22='Cologne 2016'!P22,4,IF(OR(LEFT('Cologne 2016'!$E22,1)=LEFT('Cologne 2016'!P22,1),RIGHT('Cologne 2016'!$E22,1)=RIGHT('Cologne 2016'!P22,1)),3,0))","v":0},{"$f":"IF('Cologne 2016'!$E22='Cologne 2016'!Q22,4,IF(OR(LEFT('Cologne 2016'!$E22,1)=LEFT('Cologne 2016'!Q22,1),RIGHT('Cologne 2016'!$E22,1)=RIGHT('Cologne 2016'!Q22,1)),3,0))","v":0},{"$f":"IF('Cologne 2016'!$E22='Cologne 2016'!R22,4,IF(OR(LEFT('Cologne 2016'!$E22,1)=LEFT('Cologne 2016'!R22,1),RIGHT('Cologne 2016'!$E22,1)=RIGHT('Cologne 2016'!R22,1)),3,0))","v":0},{"$f":"IF('Cologne 2016'!$E22='Cologne 2016'!S22,4,IF(OR(LEFT('Cologne 2016'!$E22,1)=LEFT('Cologne 2016'!S22,1),RIGHT('Cologne 2016'!$E22,1)=RIGHT('Cologne 2016'!S22,1)),3,0))","v":0},{"$f":"IF('Cologne 2016'!$E22='Cologne 2016'!T22,4,IF(OR(LEFT('Cologne 2016'!$E22,1)=LEFT('Cologne 2016'!T22,1),RIGHT('Cologne 2016'!$E22,1)=RIGHT('Cologne 2016'!T22,1)),3,0))","v":0}]
["mouz",null,null,{"$f":"IF('Cologne 2016'!$E23='Cologne 2016'!F23,2,0)","v":2},{"$f":"IF('Cologne 2016'!$E23='Cologne 2016'!G23,2,0)","v":0},{"$f":"IF('Cologne 2016'!$E23='Cologne 2016'!H23,2,0)","v":0},{"$f":"IF('Cologne 2016'!$E23='Cologne 2016'!I23,2,0)","v":2},{"$f":"IF('Cologne 2016'!$E23='Cologne 2016'!J23,2,0)","v":0},{"$f":"IF('Cologne 2016'!$E23='Cologne 2016'!K23,2,0)","v":0},{"$f":"IF('Cologne 2016'!$E23='Cologne 2016'!L23,2,0)","v":2},{"$f":"IF('Cologne 2016'!$E23='Cologne 2016'!M23,2,0)","v":2},{"$f":"IF('Cologne 2016'!$E23='Cologne 2016'!N23,2,0)","v":0},{"$f":"IF('Cologne 2016'!$E23='Cologne 2016'!O23,2,0)","v":0},{"$f":"IF('Cologne 2016'!$E23='Cologne 2016'!P23,2,0)","v":0},{"$f":"IF('Cologne 2016'!$E23='Cologne 2016'!Q23,2,0)","v":0},{"$f":"IF('Cologne 2016'!$E23='Cologne 2016'!R23,2,0)","v":0},{"$f":"IF('Cologne 2016'!$E23='Cologne 2016'!S23,2,0)","v":0},{"$f":"IF('Cologne 2016'!$E23='Cologne 2016'!T23,2,0)","v":0}]
["nV",null,null,{"$f":"IF('Cologne 2016'!$E24='Cologne 2016'!F24,2,0)","v":0},{"$f":"IF('Cologne 2016'!$E24='Cologne 2016'!G24,2,0)","v":0},{"$f":"IF('Cologne 2016'!$E24='Cologne 2016'!H24,2,0)","v":0},{"$f":"IF('Cologne 2016'!$E24='Cologne 2016'!I24,2,0)","v":2},{"$f":"IF('Cologne 2016'!$E24='Cologne 2016'!J24,2,0)","v":0},{"$f":"IF('Cologne 2016'!$E24='Cologne 2016'!K24,2,0)","v":0},{"$f":"IF('Cologne 2016'!$E24='Cologne 2016'!L24,2,0)","v":0},{"$f":"IF('Cologne 2016'!$E24='Cologne 2016'!M24,2,0)","v":0},{"$f":"IF('Cologne 2016'!$E24='Cologne 2016'!N24,2,0)","v":0},{"$f":"IF('Cologne 2016'!$E24='Cologne 2016'!O24,2,0)","v":0},{"$f":"IF('Cologne 2016'!$E24='Cologne 2016'!P24,2,0)","v":0},{"$f":"IF('Cologne 2016'!$E24='Cologne 2016'!Q24,2,0)","v":0},{"$f":"IF('Cologne 2016'!$E24='Cologne 2016'!R24,2,0)","v":0},{"$f":"IF('Cologne 2016'!$E24='Cologne 2016'!S24,2,0)","v":0},{"$f":"IF('Cologne 2016'!$E24='Cologne 2016'!T24,2,0)","v":0}]
["LG",null,null,3,0,2,0,1,0,2,1,5,1,1]
["fnatic",null,null,{"$f":"SUM(D21:D43)","v":46},{"$f":"SUM(E21:E43)","v":18},33,45,29,27,40,42,45,43,28,0,0,0,0]
["FaZe",null,"Quarts",{"$f":"IF('Cologne 2016'!$E29='Cologne 2016'!F29,6,IF(OR(LEFT('Cologne 2016'!$E29,1)=LEFT('Cologne 2016'!F29,1),RIGHT('Cologne 2016'!$E29,1)=RIGHT('Cologne 2016'!F29,1)),4,0))","v":0},{"$f":"IF('Cologne 2016'!$E29='Cologne 2016'!G29,6,IF(OR(LEFT('Cologne 2016'!$E29,1)=LEFT('Cologne 2016'!G29,1),RIGHT('Cologne 2016'!$E29,1)=RIGHT('Cologne 2016'!G29,1)),4,0))","v":0},{"$f":"IF('Cologne 2016'!$E29='Cologne 2016'!H29,6,IF(OR(LEFT('Cologne 2016'!$E29,1)=LEFT('Cologne 2016'!H29,1),RIGHT('Cologne 2016'!$E29,1)=RIGHT('Cologne 2016'!H29,1)),4,0))","v":4},{"$f":"IF('Cologne 2016'!$E29='Cologne 2016'!I29,6,IF(OR(LEFT('Cologne 2016'!$E29,1)=LEFT('Cologne 2016'!I29,1),RIGHT('Cologne 2016'!$E29,1)=RIGHT('Cologne 2016'!I29,1)),4,0))","v":6},{"$f":"IF('Cologne 2016'!$E29='Cologne 2016'!J29,6,IF(OR(LEFT('Cologne 2016'!$E29,1)=LEFT('Cologne 2016'!J29,1),RIGHT('Cologne 2016'!$E29,1)=RIGHT('Cologne 2016'!J29,1)),4,0))","v":6},{"$f":"IF('Cologne 2016'!$E29='Cologne 2016'!K29,6,IF(OR(LEFT('Cologne 2016'!$E29,1)=LEFT('Cologne 2016'!K29,1),RIGHT('Cologne 2016'!$E29,1)=RIGHT('Cologne 2016'!K29,1)),4,0))","v":0},{"$f":"IF('Cologne 2016'!$E29='Cologne 2016'!L29,6,IF(OR(LEFT('Cologne 2016'!$E29,1)=LEFT('Cologne 2016'!L29,1),RIGHT('Cologne 2016'!$E29,1)=RIGHT('Cologne 2016'!L29,1)),4,0))","v":6},{"$f":"IF('Cologne 2016'!$E29='Cologne 2016'!M29,6,IF(OR(LEFT('Cologne 2016'!$E29,1)=LEFT('Cologne 2016'!M29,1),RIGHT('Cologne 2016'!$E29,1)=RIGHT('Cologne 2016'!M29,1)),4,0))","v":4},{"$f":"IF('Cologne 2016'!$E29='Cologne 2016'!N29,6,IF(OR(LEFT('Cologne 2016'!$E29,1)=LEFT('Cologne 2016'!N29,1),RIGHT('Cologne 2016'!$E29,1)=RIGHT('Cologne 2016'!N29,1)),4,0))","v":6},{"$f":"IF('Cologne 2016'!$E29='Cologne 2016'!O29,6,IF(OR(LEFT('Cologne 2016'!$E29,1)=LEFT('Cologne 2016'!O29,1),RIGHT('Cologne 2016'!$E29,1)=RIGHT('Cologne 2016'!O29,1)),4,0))","v":6},{"$f":"IF('Cologne 2016'!$E29='Cologne 2016'!P29,6,IF(OR(LEFT('Cologne 2016'!$E29,1)=LEFT('Cologne 2016'!P29,1),RIGHT('Cologne 2016'!$E29,1)=RIGHT('Cologne 2016'!P29,1)),4,0))","v":6},{"$f":"IF('Cologne 2016'!$E29='Cologne 2016'!Q29,6,IF(OR(LEFT('Cologne 2016'!$E29,1)=LEFT('Cologne 2016'!Q29,1),RIGHT('Cologne 2016'!$E29,1)=RIGHT('Cologne 2016'!Q29,1)),4,0))","v":0},{"$f":"IF('Cologne 2016'!$E29='Cologne 2016'!R29,6,IF(OR(LEFT('Cologne 2016'!$E29,1)=LEFT('Cologne 2016'!R29,1),RIGHT('Cologne 2016'!$E29,1)=RIGHT('Cologne 2016'!R29,1)),4,0))","v":0},{"$f":"IF('Cologne 2016'!$E29='Cologne 2016'!S29,6,IF(OR(LEFT('Cologne 2016'!$E29,1)=LEFT('Cologne 2016'!S29,1),RIGHT('Cologne 2016'!$E29,1)=RIGHT('Cologne 2016'!S29,1)),4,0))","v":0},{"$f":"IF('Cologne 2016'!$E29='Cologne 2016'!T29,6,IF(OR(LEFT('Cologne 2016'!$E29,1)=LEFT('Cologne 2016'!T29,1),RIGHT('Cologne 2016'!$E29,1)=RIGHT('Cologne 2016'!T29,1)),4,0))","v":0}]
["G2",null,null,{"$f":"IF('Cologne 2016'!$E30='Cologne 2016'!F30,6,IF(OR(LEFT('Cologne 2016'!$E30,1)=LEFT('Cologne 2016'!F30,1),RIGHT('Cologne 2016'!$E30,1)=RIGHT('Cologne 2016'!F30,1)),4,0))","v":6},{"$f":"IF('Cologne 2016'!$E30='Cologne 2016'!G30,6,IF(OR(LEFT('Cologne 2016'!$E30,1)=LEFT('Cologne 2016'!G30,1),RIGHT('Cologne 2016'!$E30,1)=RIGHT('Cologne 2016'!G30,1)),4,0))","v":0},{"$f":"IF('Cologne 2016'!$E30='Cologne 2016'!H30,6,IF(OR(LEFT('Cologne 2016'!$E30,1)=LEFT('Cologne 2016'!H30,1),RIGHT('Cologne 2016'!$E30,1)=RIGHT('Cologne 2016'!H30,1)),4,0))","v":0},{"$f":"IF('Cologne 2016'!$E30='Cologne 2016'!I30,6,IF(OR(LEFT('Cologne 2016'!$E30,1)=LEFT('Cologne 2016'!I30,1),RIGHT('Cologne 2016'!$E30,1)=RIGHT('Cologne 2016'!I30,1)),4,0))","v":0},{"$f":"IF('Cologne 2016'!$E30='Cologne 2016'!J30,6,IF(OR(LEFT('Cologne 2016'!$E30,1)=LEFT('Cologne 2016'!J30,1),RIGHT('Cologne 2016'!$E30,1)=RIGHT('Cologne 2016'!J30,1)),4,0))","v":0},{"$f":"IF('Cologne 2016'!$E30='Cologne 2016'!K30,6,IF(OR(LEFT('Cologne 2016'!$E30,1)=LEFT('Cologne 2016'!K30,1),RIGHT('Cologne 2016'!$E30,1)=RIGHT('Cologne 2016'!K30,1)),4,0))","v":0},{"$f":"IF('Cologne 2016'!$E30='Cologne 2016'!L30,6,IF(OR(LEFT('Cologne 2016'!$E30,1)=LEFT('Cologne 2016'!L30,1),RIGHT('Cologne 2016'!$E30,1)=RIGHT('Cologne 2016'!L30,1)),4,0))","v":0},{"$f":"IF('Cologne 2016'!$E30='Cologne 2016'!M30,6,IF(OR(LEFT('Cologne 2016'!$E30,1)=LEFT('Cologne 2016'!M30,1),RIGHT('Cologne 2016'!$E30,1)=RIGHT('Cologne 2016'!M30,1)),4,0))","v":6},{"$f":"IF('Cologne 2016'!$E30='Cologne 2016'!N30,6,IF(OR(LEFT('Cologne 2016'!$E30,1)=LEFT('Cologne 2016'!N30,1),RIGHT('Cologne 2016'!$E30,1)=RIGHT('Cologne 2016'!N30,1)),4,0))","v":0},{"$f":"IF('Cologne 2016'!$E30='Cologne 2016'!O30,6,IF(OR(LEFT('Cologne 2016'!$E30,1)=LEFT('Cologne 2016'!O30,1),RIGHT('Cologne 2016'!$E30,1)=RIGHT('Cologne 2016'!O30,1)),4,0))","v":0},{"$f":"IF('Cologne 2016'!$E30='Cologne 2016'!P30,6,IF(OR(LEFT('Cologne 2016'!$E30,1)=LEFT('Cologne 2016'!P30,1),RIGHT('Cologne 2016'!$E30,1)=RIGHT('Cologne 2016'!P30,1)),4,0))","v":0},{"$f":"IF('Cologne 2016'!$E30='Cologne 2016'!Q30,6,IF(OR(LEFT('Cologne 2016'!$E30,1)=LEFT('Cologne 2016'!Q30,1),RIGHT('Cologne 2016'!$E30,1)=RIGHT('Cologne 2016'!Q30,1)),4,0))","v":0},{"$f":"IF('Cologne 2016'!$E30='Cologne 2016'!R30,6,IF(OR(LEFT('Cologne 2016'!$E30,1)=LEFT('Cologne 2016'!R30,1),RIGHT('Cologne 2016'!$E30,1)=RIGHT('Cologne 2016'!R30,1)),4,0))","v":0},{"$f":"IF('Cologne 2016'!$E30='Cologne 2016'!S30,6,IF(OR(LEFT('Cologne 2016'!$E30,1)=LEFT('Cologne 2016'!S30,1),RIGHT('Cologne 2016'!$E30,1)=RIGHT('Cologne 2016'!S30,1)),4,0))","v":0},{"$f":"IF('Cologne 2016'!$E30='Cologne 2016'!T30,6,IF(OR(LEFT('Cologne 2016'!$E30,1)=LEFT('Cologne 2016'!T30,1),RIGHT('Cologne 2016'!$E30,1)=RIGHT('Cologne 2016'!T30,1)),4,0))","v":0}]
[null,null,null,{"$f":"IF('Cologne 2016'!$E31='Cologne 2016'!F31,6,IF(OR(LEFT('Cologne 2016'!$E31,1)=LEFT('Cologne 2016'!F31,1),RIGHT('Cologne 2016'!$E31,1)=RIGHT('Cologne 2016'!F31,1)),4,0))","v":0},{"$f":"IF('Cologne 2016'!$E31='Cologne 2016'!G31,6,IF(OR(LEFT('Cologne 2016'!$E31,1)=LEFT('Cologne 2016'!G31,1),RIGHT('Cologne 2016'!$E31,1)=RIGHT('Cologne 2016'!G31,1)),4,0))","v":0},{"$f":"IF('Cologne 2016'!$E31='Cologne 2016'!H31,6,IF(OR(LEFT('Cologne 2016'!$E31,1)=LEFT('Cologne 2016'!H31,1),RIGHT('Cologne 2016'!$E31,1)=RIGHT('Cologne 2016'!H31,1)),4,0))","v":0},{"$f":"IF('Cologne 2016'!$E31='Cologne 2016'!I31,6,IF(OR(LEFT('Cologne 2016'!$E31,1)=LEFT('Cologne 2016'!I31,1),RIGHT('Cologne 2016'!$E31,1)=RIGHT('Cologne 2016'!I31,1)),4,0))","v":4},{"$f":"IF('Cologne 2016'!$E31='Cologne 2016'!J31,6,IF(OR(LEFT('Cologne 2016'!$E31,1)=LEFT('Cologne 2016'!J31,1),RIGHT('Cologne 2016'!$E31,1)=RIGHT('Cologne 2016'!J31,1)),4,0))","v":4},{"$f":"IF('Cologne 2016'!$E31='Cologne 2016'!K31,6,IF(OR(LEFT('Cologne 2016'!$E31,1)=LEFT('Cologne 2016'!K31,1),RIGHT('Cologne 2016'!$E31,1)=RIGHT('Cologne 2016'!K31,1)),4,0))","v":0},{"$f":"IF('Cologne 2016'!$E31='Cologne 2016'!L31,6,IF(OR(LEFT('Cologne 2016'!$E31,1)=LEFT('Cologne 2016'!L31,1),RIGHT('Cologne 2016'!$E31,1)=RIGHT('Cologne 2016'!L31,1)),4,0))","v":4},{"$f":"IF('Cologne 2016'!$E31='Cologne 2016'!M31,6,IF(OR(LEFT('Cologne 2016'!$E31,1)=LEFT('Cologne 2016'!M31,1),RIGHT('Cologne 2016'!$E31,1)=RIGHT('Cologne 2016'!M31,1)),4,0))","v":0},{"$f":"IF('Cologne 2016'!$E31='Cologne 2016'!N31,6,IF(OR(LEFT('Cologne 2016'!$E31,1)=LEFT('Cologne 2016'!N31,1),RIGHT('Cologne 2016'!$E31,1)=RIGHT('Cologne 2016'!N31,1)),4,0))","v":0},{"$f":"IF('Cologne 2016'!$E31='Cologne 2016'!O31,6,IF(OR(LEFT('Cologne 2016'!$E31,1)=LEFT('Cologne 2016'!O31,1),RIGHT('Cologne 2016'!$E31,1)=RIGHT('Cologne 2016'!O31,1)),4,0))","v":4},{"$f":"IF('Cologne 2016'!$E31='Cologne 2016'!P31,6,IF(OR(LEFT('Cologne 2016'!$E31,1)=LEFT('Cologne 2016'!P31,1),RIGHT('Cologne 2016'!$E31,1)=RIGHT('Cologne 2016'!P31,1)),4,0))","v":6},{"$f":"IF('Cologne 2016'!$E31='Cologne 2016'!Q31,6,IF(OR(LEFT('Cologne 2016'!$E31,1)=LEFT('Cologne 2016'!Q31,1),RIGHT('Cologne 2016'!$E31,1)=RIGHT('Cologne 2016'!Q31,1)),4,0))","v":0},{"$f":"IF('Cologne 2016'!$E31='Cologne 2016'!R31,6,IF(OR(LEFT('Cologne 2016'!$E31,1)=LEFT('Cologne 2016'!R31,1),RIGHT('Cologne 2016'!$E31,1)=RIGHT('Cologne 2016'!R31,1)),4,0))","v":0},{"$f":"IF('Cologne 2016'!$E31='Cologne 2016'!S31,6,IF(OR(LEFT('Cologne 2016'!$E31,1)=LEFT('Cologne 2016'!S31,1),RIGHT('Cologne 2016'!$E31,1)=RIGHT('Cologne 2016'!S31,1)),4,0))","v":0},{"$f":"IF('Cologne 2016'!$E31='Cologne 2016'!T31,6,IF(OR(LEFT('Cologne 2016'!$E31,1)=LEFT('Cologne 2016'!T31,1),RIGHT('Cologne 2016'!$E31,1)=RIGHT('Cologne 2016'!T31,1)),4,0))","v":0}]
[null,null,null,{"$f":"IF('Cologne 2016'!$E32='Cologne 2016'!F32,6,IF(OR(LEFT('Cologne 2016'!$E32,1)=LEFT('Cologne 2016'!F32,1),RIGHT('Cologne 2016'!$E32,1)=RIGHT('Cologne 2016'!F32,1)),4,0))","v":0},{"$f":"IF('Cologne 2016'!$E32='Cologne 2016'!G32,6,IF(OR(LEFT('Cologne 2016'!$E32,1)=LEFT('Cologne 2016'!G32,1),RIGHT('Cologne 2016'!$E32,1)=RIGHT('Cologne 2016'!G32,1)),4,0))","v":0},{"$f":"IF('Cologne 2016'!$E32='Cologne 2016'!H32,6,IF(OR(LEFT('Cologne 2016'!$E32,1)=LEFT('Cologne 2016'!H32,1),RIGHT('Cologne 2016'!$E32,1)=RIGHT('Cologne 2016'!H32,1)),4,0))","v":6},{"$f":"IF('Cologne 2016'!$E32='Cologne 2016'!I32,6,IF(OR(LEFT('Cologne 2016'!$E32,1)=LEFT('Cologne 2016'!I32,1),RIGHT('Cologne 2016'!$E32,1)=RIGHT('Cologne 2016'!I32,1)),4,0))","v":6},{"$f":"IF('Cologne 2016'!$E32='Cologne 2016'!J32,6,IF(OR(LEFT('Cologne 2016'!$E32,1)=LEFT('Cologne 2016'!J32,1),RIGHT('Cologne 2016'!$E32,1)=RIGHT('Cologne 2016'!J32,1)),4,0))","v":6},{"$f":"IF('Cologne 2016'!$E32='Cologne 2016'!K32,6,IF(OR(LEFT('Cologne 2016'!$E32,1)=LEFT('Cologne 2016'!K32,1),RIGHT('Cologne 2016'!$E32,1)=RIGHT('Cologne 2016'!K32,1)),4,0))","v":0},{"$f":"IF('Cologne 2016'!$E32='Cologne 2016'!L32,6,IF(OR(LEFT('Cologne 2016'!$E32,1)=LEFT('Cologne 2016'!L32,1),RIGHT('Cologne 2016'!$E32,1)=RIGHT('Cologne 2016'!L32,1)),4,0))","v":6},{"$f":"IF('Cologne 2016'!$E32='Cologne 2016'!M32,6,IF(OR(LEFT('Cologne 2016'!$E32,1)=LEFT('Cologne 2016'!M32,1),RIGHT('Cologne 2016'!$E32,1)=RIGHT('Cologne 2016'!M32,1)),4,0))","v":6},{"$f":"IF('Cologne 2016'!$E32='Cologne 2016'!N32,6,IF(OR(LEFT('Cologne 2016'!$E32,1)=LEFT('Cologne 2016'!N32,1),RIGHT('Cologne 2016'!$E32,1)=RIGHT('Cologne 2016'!N32,1)),4,0))","v":6},{"$f":"IF('Cologne 2016'!$E32='Cologne 2016'!O32,6,IF(OR(LEFT('Cologne 2016'!$E32,1)=LEFT('Cologne 2016'!O32,1),RIGHT('Cologne 2016'!$E32,1)=RIGHT('Cologne 2016'!O32,1)),4,0))","v":6},{"$f":"IF('Cologne 2016'!$E32='Cologne 2016'!P32,6,IF(OR(LEFT('Cologne 2016'!$E32,1)=LEFT('Cologne 2016'!P32,1),RIGHT('Cologne 2016'!$E32,1)=RIGHT('Cologne 2016'!P32,1)),4,0))","v":6},{"$f":"IF('Cologne 2016'!$E32='Cologne 2016'!Q32,6,IF(OR(LEFT('Cologne 2016'!$E32,1)=LEFT('Cologne 2016'!Q32,1),RIGHT('Cologne 2016'!$E32,1)=RIGHT('Cologne 2016'!Q32,1)),4,0))","v":0},{"$f":"IF('Cologne 2016'!$E32='Cologne 2016'!R32,6,IF(OR(LEFT('Cologne 2016'!$E32,1)=LEFT('Cologne 2016'!R32,1),RIGHT('Cologne 2016'!$E32,1)=RIGHT('Cologne 2016'!R32,1)),4,0))","v":0},{"$f":"IF('Cologne 2016'!$E32='Cologne 2016'!S32,6,IF(OR(LEFT('Cologne 2016'!$E32,1)=LEFT('Cologne 2016'!S32,1),RIGHT('Cologne 2016'!$E32,1)=RIGHT('Cologne 2016'!S32,1)),4,0))","v":0},{"$f":"IF('Cologne 2016'!$E32='Cologne 2016'!T32,6,IF(OR(LEFT('Cologne 2016'!$E32,1)=LEFT('Cologne 2016'!T32,1),RIGHT('Cologne 2016'!$E32,1)=RIGHT('Cologne 2016'!T32,1)),4,0))","v":0}]
["Quarts",null,"Demies",{"$f":"IF('Cologne 2016'!$E37='Cologne 2016'!F37,7,IF(OR(LEFT('Cologne 2016'!$E37,1)=LEFT('Cologne 2016'!F37,1),RIGHT('Cologne 2016'!$E37,1)=RIGHT('Cologne 2016'!F37,1)),5,0))","v":0},{"$f":"IF('Cologne 2016'!$E37='Cologne 2016'!G37,7,IF(OR(LEFT('Cologne 2016'!$E37,1)=LEFT('Cologne 2016'!G37,1),RIGHT('Cologne 2016'!$E37,1)=RIGHT('Cologne 2016'!G37,1)),5,0))","v":0},{"$f":"IF('Cologne 2016'!$E37='Cologne 2016'!H37,7,IF(OR(LEFT('Cologne 2016'!$E37,1)=LEFT('Cologne 2016'!H37,1),RIGHT('Cologne 2016'!$E37,1)=RIGHT('Cologne 2016'!H37,1)),5,0))","v":0},{"$f":"IF('Cologne 2016'!$E37='Cologne 2016'!I37,7,IF(OR(LEFT('Cologne 2016'!$E37,1)=LEFT('Cologne 2016'!I37,1),RIGHT('Cologne 2016'!$E37,1)=RIGHT('Cologne 2016'!I37,1)),5,0))","v":5},{"$f":"IF('Cologne 2016'!$E37='Cologne 2016'!J37,7,IF(OR(LEFT('Cologne 2016'!$E37,1)=LEFT('Cologne 2016'!J37,1),RIGHT('Cologne 2016'!$E37,1)=RIGHT('Cologne 2016'!J37,1)),5,0))","v":5},{"$f":"IF('Cologne 2016'!$E37='Cologne 2016'!K37,7,IF(OR(LEFT('Cologne 2016'!$E37,1)=LEFT('Cologne 2016'!K37,1),RIGHT('Cologne 2016'!$E37,1)=RIGHT('Cologne 2016'!K37,1)),5,0))","v":0},{"$f":"IF('Cologne 2016'!$E37='Cologne 2016'!L37,7,IF(OR(LEFT('Cologne 2016'!$E37,1)=LEFT('Cologne 2016'!L37,1),RIGHT('Cologne 2016'!$E37,1)=RIGHT('Cologne 2016'!L37,1)),5,0))","v":5},{"$f":"IF('Cologne 2016'!$E37='Cologne 2016'!M37,7,IF(OR(LEFT('Cologne 2016'!$E37,1)=LEFT('Cologne 2016'!M37,1),RIGHT('Cologne 2016'!$E37,1)=RIGHT('Cologne 2016'!M37,1)),5,0))","v":7},{"$f":"IF('Cologne 2016'!$E37='Cologne 2016'!N37,7,IF(OR(LEFT('Cologne 2016'!$E37,1)=LEFT('Cologne 2016'!N37,1),RIGHT('Cologne 2016'!$E37,1)=RIGHT('Cologne 2016'!N37,1)),5,0))","v":7},{"$f":"IF('Cologne 2016'!$E37='Cologne 2016'!O37,7,IF(OR(LEFT('Cologne 2016'!$E37,1)=LEFT('Cologne 2016'!O37,1),RIGHT('Cologne 2016'!$E37,1)=RIGHT('Cologne 2016'!O37,1)),5,0))","v":7},{"$f":"IF('Cologne 2016'!$E37='Cologne 2016'!P37,7,IF(OR(LEFT('Cologne 2016'!$E37,1)=LEFT('Cologne 2016'!P37,1),RIGHT('Cologne 2016'!$E37,1)=RIGHT('Cologne 2016'!P37,1)),5,0))","v":5},{"$f":"IF('Cologne 2016'!$E37='Cologne 2016'!Q37,7,IF(OR(LEFT('Cologne 2016'!$E37,1)=LEFT('Cologne 2016'!Q37,1),RIGHT('Cologne 2016'!$E37,1)=RIGHT('Cologne 2016'!Q37,1)),5,0))","v":0},{"$f":"IF('Cologne 2016'!$E37='Cologne 2016'!R37,7,IF(OR(LEFT('Cologne 2016'!$E37,1)=LEFT('Cologne 2016'!R37,1),RIGHT('Cologne 2016'!$E37,1)=RIGHT('Cologne 2016'!R37,1)),5,0))","v":0},{"$f":"IF('Cologne 2016'!$E37='Cologne 2016'!S37,7,IF(OR(LEFT('Cologne 2016'!$E37,1)=LEFT('Cologne 2016'!S37,1),RIGHT('Cologne 2016'!$E37,1)=RIGHT('Cologne 2016'!S37,1)),5,0))","v":0},{"$f":"IF('Cologne 2016'!$E37='Cologne 2016'!T37,7,IF(OR(LEFT('Cologne 2016'!$E37,1)=LEFT('Cologne 2016'!T37,1),RIGHT('Cologne 2016'!$E37,1)=RIGHT('Cologne 2016'!T37,1)),5,0))","v":0}]
[{"$f":"ISBLANK('Cologne 2016'!E5)","v":false},null,null,{"$f":"IF('Cologne 2016'!$E38='Cologne 2016'!F38,7,IF(OR(LEFT('Cologne 2016'!$E38,1)=LEFT('Cologne 2016'!F38,1),RIGHT('Cologne 2016'!$E38,1)=RIGHT('Cologne 2016'!F38,1)),5,0))","v":0},{"$f":"IF('Cologne 2016'!$E38='Cologne 2016'!G38,7,IF(OR(LEFT('Cologne 2016'!$E38,1)=LEFT('Cologne 2016'!G38,1),RIGHT('Cologne 2016'!$E38,1)=RIGHT('Cologne 2016'!G38,1)),5,0))","v":0},{"$f":"IF('Cologne 2016'!$E38='Cologne 2016'!H38,7,IF(OR(LEFT('Cologne 2016'!$E38,1)=LEFT('Cologne 2016'!H38,1),RIGHT('Cologne 2016'!$E38,1)=RIGHT('Cologne 2016'!H38,1)),5,0))","v":0},{"$f":"IF('Cologne 2016'!$E38='Cologne 2016'!I38,7,IF(OR(LEFT('Cologne 2016'!$E38,1)=LEFT('Cologne 2016'!I38,1),RIGHT('Cologne 2016'!$E38,1)=RIGHT('Cologne 2016'!I38,1)),5,0))","v":0},{"$f":"IF('Cologne 2016'!$E38='Cologne 2016'!J38,7,IF(OR(LEFT('Cologne 2016'!$E38,1)=LEFT('Cologne 2016'!J38,1),RIGHT('Cologne 2016'!$E38,1)=RIGHT('Cologne 2016'!J38,1)),5,0))","v":0},{"$f":"IF('Cologne 2016'!$E38='Cologne 2016'!K38,7,IF(OR(LEFT('Cologne 2016'!$E38,1)=LEFT('Cologne 2016'!K38,1),RIGHT('Cologne 2016'!$E38,1)=RIGHT('Cologne 2016'!K38,1)),5,0))","v":0},{"$f":"IF('Cologne 2016'!$E38='Cologne 2016'!L38,7,IF(OR(LEFT('Cologne 2016'!$E38,1)=LEFT('Cologne 2016'!L38,1),RIGHT('Cologne 2016'!$E38,1)=RIGHT('Cologne 2016'!L38,1)),5,0))","v":0},{"$f":"IF('Cologne 2016'!$E38='Cologne 2016'!M38,7,IF(OR(LEFT('Cologne 2016'!$E38,1)=LEFT('Cologne 2016'!M38,1),RIGHT('Cologne 2016'!$E38,1)=RIGHT('Cologne 2016'!M38,1)),5,0))","v":0},{"$f":"IF('Cologne 2016'!$E38='Cologne 2016'!N38,7,IF(OR(LEFT('Cologne 2016'!$E38,1)=LEFT('Cologne 2016'!N38,1),RIGHT('Cologne 2016'!$E38,1)=RIGHT('Cologne 2016'!N38,1)),5,0))","v":0},{"$f":"IF('Cologne 2016'!$E38='Cologne 2016'!O38,7,IF(OR(LEFT('Cologne 2016'!$E38,1)=LEFT('Cologne 2016'!O38,1),RIGHT('Cologne 2016'!$E38,1)=RIGHT('Cologne 2016'!O38,1)),5,0))","v":0},{"$f":"IF('Cologne 2016'!$E38='Cologne 2016'!P38,7,IF(OR(LEFT('Cologne 2016'!$E38,1)=LEFT('Cologne 2016'!P38,1),RIGHT('Cologne 2016'!$E38,1)=RIGHT('Cologne 2016'!P38,1)),5,0))","v":0},{"$f":"IF('Cologne 2016'!$E38='Cologne 2016'!Q38,7,IF(OR(LEFT('Cologne 2016'!$E38,1)=LEFT('Cologne 2016'!Q38,1),RIGHT('Cologne 2016'!$E38,1)=RIGHT('Cologne 2016'!Q38,1)),5,0))","v":0},{"$f":"IF('Cologne 2016'!$E38='Cologne 2016'!R38,7,IF(OR(LEFT('Cologne 2016'!$E38,1)=LEFT('Cologne 2016'!R38,1),RIGHT('Cologne 2016'!$E38,1)=RIGHT('Cologne 2016'!R38,1)),5,0))","v":0},{"$f":"IF('Cologne 2016'!$E38='Cologne 2016'!S38,7,IF(OR(LEFT('Cologne 2016'!$E38,1)=LEFT('Cologne 2016'!S38,1),RIGHT('Cologne 2016'!$E38,1)=RIGHT('Cologne 2016'!S38,1)),5,0))","v":0},{"$f":"IF('Cologne 2016'!$E38='Cologne 2016'!T38,7,IF(OR(LEFT('Cologne 2016'!$E38,1)=LEFT('Cologne 2016'!T38,1),RIGHT('Cologne 2016'!$E38,1)=RIGHT('Cologne 2016'!T38,1)),5,0))","v":0}]
[{"$f":"ISBLANK('Cologne 2016'!E10)","v":false},null,"Finale",{"$f":"IF('Cologne 2016'!$E47='Cologne 2016'!F47,9,IF(OR(LEFT('Cologne 2016'!$E47,1)=LEFT('Cologne 2016'!F47,1),RIGHT('Cologne 2016'!$E47,1)=RIGHT('Cologne 2016'!F47,1)),6,0))","v":0},{"$f":"IF('Cologne 2016'!$E47='Cologne 2016'!G47,9,IF(OR(LEFT('Cologne 2016'!$E47,1)=LEFT('Cologne 2016'!G47,1),RIGHT('Cologne 2016'!$E47,1)=RIGHT('Cologne 2016'!G47,1)),6,0))","v":0},{"$f":"IF('Cologne 2016'!$E47='Cologne 2016'!H47,9,IF(OR(LEFT('Cologne 2016'!$E47,1)=LEFT('Cologne 2016'!H47,1),RIGHT('Cologne 2016'!$E47,1)=RIGHT('Cologne 2016'!H47,1)),6,0))","v":0},{"$f":"IF('Cologne 2016'!$E47='Cologne 2016'!I47,9,IF(OR(LEFT('Cologne 2016'!$E47,1)=LEFT('Cologne 2016'!I47,1),RIGHT('Cologne 2016'!$E47,1)=RIGHT('Cologne 2016'!I47,1)),6,0))","v":6},{"$f":"IF('Cologne 2016'!$E47='Cologne 2016'!J47,9,IF(OR(LEFT('Cologne 2016'!$E47,1)=LEFT('Cologne 2016'!J47,1),RIGHT('Cologne 2016'!$E47,1)=RIGHT('Cologne 2016'!J47,1)),6,0))","v":6},{"$f":"IF('Cologne 2016'!$E47='Cologne 2016'!K47,9,IF(OR(LEFT('Cologne 2016'!$E47,1)=LEFT('Cologne 2016'!K47,1),RIGHT('Cologne 2016'!$E47,1)=RIGHT('Cologne 2016'!K47,1)),6,0))","v":6},{"$f":"IF('Cologne 2016'!$E47='Cologne 2016'!L47,9,IF(OR(LEFT('Cologne 2016'!$E47,1)=LEFT('Cologne 2016'!L47,1),RIGHT('Cologne 2016'!$E47,1)=RIGHT('Cologne 2016'!L47,1)),6,0))","v":9},{"$f":"IF('Cologne 2016'!$E47='Cologne 2016'!M47,9,IF(OR(LEFT('Cologne 2016'!$E47,1)=LEFT('Cologne 2016'!M47,1),RIGHT('Cologne 2016'!$E47,1)=RIGHT('Cologne 2016'!M47,1)),6,0))","v":6},{"$f":"IF('Cologne 2016'!$E47='Cologne 2016'!N47,9,IF(OR(LEFT('Cologne 2016'!$E47,1)=LEFT('Cologne 2016'!N47,1),RIGHT('Cologne 2016'!$E47,1)=RIGHT('Cologne 2016'!N47,1)),6,0))","v":6},{"$f":"IF('Cologne 2016'!$E47='Cologne 2016'!O47,9,IF(OR(LEFT('Cologne 2016'!$E47,1)=LEFT('Cologne 2016'!O47,1),RIGHT('Cologne 2016'!$E47,1)=RIGHT('Cologne 2016'!O47,1)),6,0))","v":9},{"$f":"IF('Cologne 2016'!$E47='Cologne 2016'!P47,9,IF(OR(LEFT('Cologne 2016'!$E47,1)=LEFT('Cologne 2016'!P47,1),RIGHT('Cologne 2016'!$E47,1)=RIGHT('Cologne 2016'!P47,1)),6,0))","v":0},{"$f":"IF('Cologne 2016'!$E47='Cologne 2016'!Q47,9,IF(OR(LEFT('Cologne 2016'!$E47,1)=LEFT('Cologne 2016'!Q47,1),RIGHT('Cologne 2016'!$E47,1)=RIGHT('Cologne 2016'!Q47,1)),6,0))","v":0},{"$f":"IF('Cologne 2016'!$E47='Cologne 2016'!R47,9,IF(OR(LEFT('Cologne 2016'!$E47,1)=LEFT('Cologne 2016'!R47,1),RIGHT('Cologne 2016'!$E47,1)=RIGHT('Cologne 2016'!R47,1)),6,0))","v":0},{"$f":"IF('Cologne 2016'!$E47='Cologne 2016'!S47,9,IF(OR(LEFT('Cologne 2016'!$E47,1)=LEFT('Cologne 2016'!S47,1),RIGHT('Cologne 2016'!$E47,1)=RIGHT('Cologne 2016'!S47,1)),6,0))","v":0},{"$f":"IF('Cologne 2016'!$E47='Cologne 2016'!T47,9,IF(OR(LEFT('Cologne 2016'!$E47,1)=LEFT('Cologne 2016'!T47,1),RIGHT('Cologne 2016'!$E47,1)=RIGHT('Cologne 2016'!T47,1)),6,0))","v":0}]
[{"$f":"ISBLANK('Cologne 2016'!E15)","v":false}]
[{"$f":"ISBLANK('Cologne 2016'!E20)","v":false}]
[]
["Demies",null,"Bonus",4,0,0,4,4,0,2,2,2,4,6]
[{"$f":"'Cologne 2016'!C29","v":"Gambit"},null,null,0,0,4,4,6,0,4,6,6,6,6]
[{"$f":"'Cologne 2016'!C30","v":"NaVi"}]
[{"$f":"'Cologne 2016'!C31","v":"VP"},null,null,{"$f":"IF('Cologne 2016'!$E$48='Cologne 2016'!D51,3,IF(OR('Cologne 2016'!$E$48='Cologne 2016'!D52,'Cologne 2016'!$E$48='Cologne 2016'!D53),2,0))","v":0},{"$f":"IF('Cologne 2016'!$E$48='Cologne 2016'!E51,3,IF(OR('Cologne 2016'!$E$48='Cologne 2016'!E52,'Cologne 2016'!$E$48='Cologne 2016'!E53),2,0))","v":0},{"$f":"IF('Cologne 2016'!$E$48='Cologne 2016'!F51,3,IF(OR('Cologne 2016'!$E$48='Cologne 2016'!F52,'Cologne 2016'!$E$48='Cologne 2016'!F53),2,0))","v":0},{"$f":"IF('Cologne 2016'!$E$48='Cologne 2016'!G51,3,IF(OR('Cologne 2016'!$E$48='Cologne 2016'!G52,'Cologne 2016'!$E$48='Cologne 2016'!G53),2,0))","v":0},{"$f":"IF('Cologne 2016'!$E$48='Cologne 2016'!H51,3,IF(OR('Cologne 2016'!$E$48='Cologne 2016'!H52,'Cologne 2016'!$E$48='Cologne 2016'!H53),2,0))","v":0},{"$f":"IF('Cologne 2016'!$E$48='Cologne 2016'!I51,3,IF(OR('Cologne 2016'!$E$48='Cologne 2016'!I52,'Cologne 2016'!$E$48='Cologne 2016'!I53),2,0))","v":0},{"$f":"IF('Cologne 2016'!$E$48='Cologne 2016'!J51,3,IF(OR('Cologne 2016'!$E$48='Cologne 2016'!J52,'Cologne 2016'!$E$48='Cologne 2016'!J53),2,0))","v":0},{"$f":"IF('Cologne 2016'!$E$48='Cologne 2016'!K51,3,IF(OR('Cologne 2016'!$E$48='Cologne 2016'!K52,'Cologne 2016'!$E$48='Cologne 2016'!K53),2,0))","v":0},{"$f":"IF('Cologne 2016'!$E$48='Cologne 2016'!L51,3,IF(OR('Cologne 2016'!$E$48='Cologne 2016'!L52,'Cologne 2016'!$E$48='Cologne 2016'!L53),2,0))","v":0},{"$f":"IF('Cologne 2016'!$E$48='Cologne 2016'!M51,3,IF(OR('Cologne 2016'!$E$48='Cologne 2016'!M52,'Cologne 2016'!$E$48='Cologne 2016'!M53),2,0))","v":0},{"$f":"IF('Cologne 2016'!$E$48='Cologne 2016'!N51,3,IF(OR('Cologne 2016'!$E$48='Cologne 2016'!N52,'Cologne 2016'!$E$48='Cologne 2016'!N53),2,0))","v":0},{"$f":"IF('Cologne 2016'!$E$48='Cologne 2016'!O51,3,IF(OR('Cologne 2016'!$E$48='Cologne 2016'!O52,'Cologne 2016'!$E$48='Cologne 2016'!O53),2,0))","v":0},{"$f":"IF('Cologne 2016'!$E$48='Cologne 2016'!P51,3,IF(OR('Cologne 2016'!$E$48='Cologne 2016'!P52,'Cologne 2016'!$E$48='Cologne 2016'!P53),2,0))","v":0},{"$f":"IF('Cologne 2016'!$E$48='Cologne 2016'!Q51,3,IF(OR('Cologne 2016'!$E$48='Cologne 2016'!Q52,'Cologne 2016'!$E$48='Cologne 2016'!Q53),2,0))","v":0},{"$f":"IF('Cologne 2016'!$E$48='Cologne 2016'!R51,3,IF(OR('Cologne 2016'!$E$48='Cologne 2016'!R52,'Cologne 2016'!$E$48='Cologne 2016'!R53),2,0))","v":0}]
[{"$f":"'Cologne 2016'!C32","v":"LG"},null,null,{"$f":"IF(OR('Cologne 2016'!$E$49='Cologne 2016'!D52,'Cologne 2016'!$E$49='Cologne 2016'!D53,'Cologne 2016'!$E$49='Cologne 2016'!D51),2,0)","v":0},{"$f":"IF(OR('Cologne 2016'!$E$49='Cologne 2016'!E52,'Cologne 2016'!$E$49='Cologne 2016'!E53,'Cologne 2016'!$E$49='Cologne 2016'!E51),2,0)","v":0},{"$f":"IF(OR('Cologne 2016'!$E$49='Cologne 2016'!F52,'Cologne 2016'!$E$49='Cologne 2016'!F53,'Cologne 2016'!$E$49='Cologne 2016'!F51),2,0)","v":0},{"$f":"IF(OR('Cologne 2016'!$E$49='Cologne 2016'!G52,'Cologne 2016'!$E$49='Cologne 2016'!G53,'Cologne 2016'!$E$49='Cologne 2016'!G51),2,0)","v":0},{"$f":"IF(OR('Cologne 2016'!$E$49='Cologne 2016'!H52,'Cologne 2016'!$E$49='Cologne 2016'!H53,'Cologne 2016'!$E$49='Cologne 2016'!H51),2,0)","v":0},{"$f":"IF(OR('Cologne 2016'!$E$49='Cologne 2016'!I52,'Cologne 2016'!$E$49='Cologne 2016'!I53,'Cologne 2016'!$E$49='Cologne 2016'!I51),2,0)","v":0},{"$f":"IF(OR('Cologne 2016'!$E$49='Cologne 2016'!J52,'Cologne 2016'!$E$49='Cologne 2016'!J53,'Cologne 2016'!$E$49='Cologne 2016'!J51),2,0)","v":0},{"$f":"IF(OR('Cologne 2016'!$E$49='Cologne 2016'!K52,'Cologne 2016'!$E$49='Cologne 2016'!K53,'Cologne 2016'!$E$49='Cologne 2016'!K51),2,0)","v":0},{"$f":"IF(OR('Cologne 2016'!$E$49='Cologne 2016'!L52,'Cologne 2016'!$E$49='Cologne 2016'!L53,'Cologne 2016'!$E$49='Cologne 2016'!L51),2,0)","v":0},{"$f":"IF(OR('Cologne 2016'!$E$49='Cologne 2016'!M52,'Cologne 2016'!$E$49='Cologne 2016'!M53,'Cologne 2016'!$E$49='Cologne 2016'!M51),2,0)","v":0},{"$f":"IF(OR('Cologne 2016'!$E$49='Cologne 2016'!N52,'Cologne 2016'!$E$49='Cologne 2016'!N53,'Cologne 2016'!$E$49='Cologne 2016'!N51),2,0)","v":0},{"$f":"IF(OR('Cologne 2016'!$E$49='Cologne 2016'!O52,'Cologne 2016'!$E$49='Cologne 2016'!O53,'Cologne 2016'!$E$49='Cologne 2016'!O51),2,0)","v":0},{"$f":"IF(OR('Cologne 2016'!$E$49='Cologne 2016'!P52,'Cologne 2016'!$E$49='Cologne 2016'!P53,'Cologne 2016'!$E$49='Cologne 2016'!P51),2,0)","v":0},{"$f":"IF(OR('Cologne 2016'!$E$49='Cologne 2016'!Q52,'Cologne 2016'!$E$49='Cologne 2016'!Q53,'Cologne 2016'!$E$49='Cologne 2016'!Q51),2,0)","v":0},{"$f":"IF(OR('Cologne 2016'!$E$49='Cologne 2016'!R52,'Cologne 2016'!$E$49='Cologne 2016'!R53,'Cologne 2016'!$E$49='Cologne 2016'!R51),2,0)","v":0}]
[{"$f":"'Cologne 2016'!D29","v":"fnatic"},null,null,{"$f":"IF(OR('Cologne 2016'!$E$50='Cologne 2016'!D52,'Cologne 2016'!$E$50='Cologne 2016'!D53,'Cologne 2016'!$E$50='Cologne 2016'!D51),2,0)","v":0},{"$f":"IF(OR('Cologne 2016'!$E$50='Cologne 2016'!E52,'Cologne 2016'!$E$50='Cologne 2016'!E53,'Cologne 2016'!$E$50='Cologne 2016'!E51),2,0)","v":0},{"$f":"IF(OR('Cologne 2016'!$E$50='Cologne 2016'!F52,'Cologne 2016'!$E$50='Cologne 2016'!F53,'Cologne 2016'!$E$50='Cologne 2016'!F51),2,0)","v":0},{"$f":"IF(OR('Cologne 2016'!$E$50='Cologne 2016'!G52,'Cologne 2016'!$E$50='Cologne 2016'!G53,'Cologne 2016'!$E$50='Cologne 2016'!G51),2,0)","v":0},{"$f":"IF(OR('Cologne 2016'!$E$50='Cologne 2016'!H52,'Cologne 2016'!$E$50='Cologne 2016'!H53,'Cologne 2016'!$E$50='Cologne 2016'!H51),2,0)","v":0},{"$f":"IF(OR('Cologne 2016'!$E$50='Cologne 2016'!I52,'Cologne 2016'!$E$50='Cologne 2016'!I53,'Cologne 2016'!$E$50='Cologne 2016'!I51),2,0)","v":0},{"$f":"IF(OR('Cologne 2016'!$E$50='Cologne 2016'!J52,'Cologne 2016'!$E$50='Cologne 2016'!J53,'Cologne 2016'!$E$50='Cologne 2016'!J51),2,0)","v":0},{"$f":"IF(OR('Cologne 2016'!$E$50='Cologne 2016'!K52,'Cologne 2016'!$E$50='Cologne 2016'!K53,'Cologne 2016'!$E$50='Cologne 2016'!K51),2,0)","v":0},{"$f":"IF(OR('Cologne 2016'!$E$50='Cologne 2016'!L52,'Cologne 2016'!$E$50='Cologne 2016'!L53,'Cologne 2016'!$E$50='Cologne 2016'!L51),2,0)","v":0},{"$f":"IF(OR('Cologne 2016'!$E$50='Cologne 2016'!M52,'Cologne 2016'!$E$50='Cologne 2016'!M53,'Cologne 2016'!$E$50='Cologne 2016'!M51),2,0)","v":0},{"$f":"IF(OR('Cologne 2016'!$E$50='Cologne 2016'!N52,'Cologne 2016'!$E$50='Cologne 2016'!N53,'Cologne 2016'!$E$50='Cologne 2016'!N51),2,0)","v":0},{"$f":"IF(OR('Cologne 2016'!$E$50='Cologne 2016'!O52,'Cologne 2016'!$E$50='Cologne 2016'!O53,'Cologne 2016'!$E$50='Cologne 2016'!O51),2,0)","v":0},{"$f":"IF(OR('Cologne 2016'!$E$50='Cologne 2016'!P52,'Cologne 2016'!$E$50='Cologne 2016'!P53,'Cologne 2016'!$E$50='Cologne 2016'!P51),2,0)","v":0},{"$f":"IF(OR('Cologne 2016'!$E$50='Cologne 2016'!Q52,'Cologne 2016'!$E$50='Cologne 2016'!Q53,'Cologne 2016'!$E$50='Cologne 2016'!Q51),2,0)","v":0},{"$f":"IF(OR('Cologne 2016'!$E$50='Cologne 2016'!R52,'Cologne 2016'!$E$50='Cologne 2016'!R53,'Cologne 2016'!$E$50='Cologne 2016'!R51),2,0)","v":0}]
[{"$f":"'Cologne 2016'!D30","v":"Liquid"}]
[{"$f":"'Cologne 2016'!D31","v":"Astralis"}]
[{"$f":"'Cologne 2016'!D32","v":"Flipside"}]
[]
["finale"]

{"sheet":"ELEAGUE","index":4,"n_rows":82,"n_cols":23,"rows_kept":82,"cut":false,"hidden":false,"merged":[[0,20,0,22],[53,1,53,2],[54,1,54,2],[55,0,55,2],[64,0,64,2],[14,0,21,0],[23,1,23,2],[24,0,31,0],[33,1,33,2],[34,0,41,0],[43,1,43,2],[44,0,51,0],[13,1,13,2],[4,0,11,0],[71,0,71,2],[69,0,70,1],[66,0,66,2],[60,0,63,1],[81,1,81,2],[73,0,73,2],[75,0,75,1],[76,0,76,1],[77,0,77,1],[78,0,78,2],[79,0,79,2]]}
[null,null,null,"Jazz","doyL","Epicier","darks","Lema","Cpassimal","edia","budo","peRf","shogoki","douzer","ventur","Kevnay","Neo","Nico",null,null,"classement"]
["Bonus","Vainqueur Major",null,"faze","astralis","vp",null,"navi","navi","navi","vp","astralis","astralis","sk","astralis","sk","astralis",null,null,null,"1er",{"$f":"'Data EL'!AK2","v":"ventur"},{"$f":"'Data EL'!AL2","v":101}]
[null,"Vainqueur FFF",null,"kevnay","perf","edialor","douz","ventur","Cpassimal",null,"perf","ventur","perf","douzer","kevnay","ventur","perf",null,null,null,{"$f":"IF(W2=W3,\"-\",\"2eme\")","v":"2eme"},{"$f":"'Data EL'!AK3","v":"peRf"},{"$f":"'Data EL'!AL3","v":95}]
[null,"Total bonus",null,0,5,0,0,5,0,0,0,10,5,0,5,5,5,null,null,null,{"$f":"IF(W4=W3,\"-\",\"3eme\")","v":"3eme"},{"$f":"'Data EL'!AK4","v":"Kevnay"},{"$f":"'Data EL'!AL4","v":92}]
["Jour 1","gambit - north","gambit","north","north","gambit","north","gambit","gambit","gambit","north","north","north","north","gambit","north","north",null,null,null,{"$f":"IF(W5=W4,\"-\",\"4eme\")","v":"4eme"},{"$f":"'Data EL'!AK5","v":"douzer"},{"$f":"'Data EL'!AL5","v":80}]
[null,"fnatic - g2","g2","fnatic","g2","g2","g2","g2","g2","fnatic","g2","fnatic","g2","fnatic","fnatic","g2","fnatic",null,null,null,{"$f":"IF(W6=W5,\"-\",\"5eme\")","v":"5eme"},{"$f":"'Data EL'!AK6","v":"Jazz"},{"$f":"'Data EL'!AL6","v":76}]
[null,"sk - hr","sk","sk","hr","hr","sk","sk","sk","sk","sk","sk","sk","sk","sk","sk","sk",null,null,null,{"$f":"IF(W7=W6,\"-\",\"6eme\")","v":"-"},{"$f":"'Data EL'!AK7","v":"budo"},{"$f":"'Data EL'!AL7","v":76}]
[null,"vp - optic","vp","optic","vp","vp","optic","vp","vp","optic","vp","vp","vp","vp","optic","vp","vp",null,null,null,{"$f":"IF(W8=W7,\"-\",\"7eme\")","v":"7eme"},{"$f":"'Data EL'!AK8","v":"Lema"},{"$f":"'Data EL'!AL8","v":72}]
[null,"navi - mouz","navi","navi","mouz","mouz","navi","navi","navi","navi","navi","navi","navi","navi","navi","navi","navi",null,null,null,{"$f":"IF(W9=W8,\"-\",\"8eme\")","v":"8eme"},{"$f":"'Data EL'!AK9","v":"Cpassimal"},{"$f":"'Data EL'!AL9","v":71}]
[null,"liquid - nv","nv","nv","nv","nv","liquid","nv","liquid","nv","liquid","nv","nv","nv","nv","nv","nv",null,null,null,{"$f":"IF(W10=W9,\"-\",\"9eme\")","v":"9eme"},{"$f":"'Data EL'!AK10","v":"Epicier"},{"$f":"'Data EL'!AL10","v":67}]
[null,"astralis - godsent","godsent","astralis","astralis","astralis","godsent","astralis","astralis","astralis","astralis","astralis","astralis","astralis","astralis","astralis","astralis",null,null,null,{"$f":"IF(W11=W10,\"-\",\"10eme\")","v":"10eme"},{"$f":"'Data EL'!AK11","v":"Neo"},{"$f":"'Data EL'!AL11","v":65}]
[null,"f3 - faze","faze","faze","faze","f3","faze","faze","faze","faze","faze","faze","faze","faze","faze","faze","faze",null,null,null,{"$f":"IF(W12=W11,\"-\",\"11eme\")","v":"11eme"},{"$f":"'Data EL'!AK12","v":"doyL"},{"$f":"'Data EL'!AL12","v":50}]
["bonus du jour","/","/",null,null,null,null,null,null,null,null,null,null,null,null,null,null,null,null,null,{"$f":"IF(W13=W12,\"-\",\"12eme\")","v":"12eme"},{"$f":"'Data EL'!AK13","v":"darks"},{"$f":"'Data EL'!AL13","v":42}]
[null,"Sous total",null,{"$f":"'Data EL'!D13","v":12},{"$f":"'Data EL'!E13","v":12},{"$f":"'Data EL'!F13","v":12},{"$f":"'Data EL'!G13","v":15},{"$f":"'Data EL'!H13","v":21},{"$f":"'Data EL'!I13","v":18},{"$f":"'Data EL'!J13","v":15},{"$f":"'Data EL'!K13","v":15},{"$f":"'Data EL'!L13","v":15},{"$f":"'Data EL'!M13","v":18},{"$f":"'Data EL'!N13","v":15},{"$f":"'Data EL'!O13","v":15},{"$f":"'Data EL'!P13","v":18},{"$f":"'Data EL'!Q13","v":15},{"$f":"'Data EL'!R13","v":0},null,null,{"$f":"IF(W14=W13,\"-\",\"13eme\")","v":"13eme"},{"$f":"'Data EL'!AK14","v":"shogoki"},{"$f":"'Data EL'!AL14","v":23}]
["Jour 2","mouz - hr","mouz","mouz","mouz","mouz","mouz","mouz","mouz",null,"mouz","mouz",null,"mouz","mouz","mouz","mouz",null,null,null,{"$f":"IF(W15=W14,\"-\",\"14eme\")","v":"14eme"},{"$f":"'Data EL'!AK15","v":"edia"},{"$f":"'Data EL'!AL15","v":15}]
[null,"navi - nv","navi","navi","nv","navi","navi","navi","navi",null,"navi","navi",null,"navi","navi","navi","navi"]
[null,"faze - sk","sk","faze","faze","sk","sk","sk","sk",null,"sk","sk",null,"sk","faze","sk","sk"]
[null,"flipside - liquid","liquid","liquid","liquid","flipside","liquid","liquid","liquid",null,"liquid","liquid",null,"flipside","liquid","liquid","flipside"]
[null,"north - fnatic","fnatic","fnatic","fnatic","fnatic","fnatic","fnatic","fnatic",null,"fnatic","fnatic",null,"fnatic","fnatic","fnatic","fnatic"]
[null,"optic - astralis","astralis","optic","astralis","astralis","astralis","astralis","astralis",null,"astralis","astralis",null,"optic","astralis","astralis","astralis"]
[null,"godsent - gambit","gambit","godsent","godsent","godsent","gambit","gambit","godsent",null,"godsent","godsent",null,"godsent","godsent","godsent","gambit"]
[null,"vp - g2","vp","vp","g2","g2","g2","g2","vp",null,"vp","g2",null,"vp","vp","vp","vp"]
["bonus du jour","rekt","navi - nv","navi - nv","optic - astralis","faze - sk","godsent - gambit","vp - g2","flipside - liquid",null,"flipside - liquid","mouz - hr",null,"mouz - hr","godsent - gambit","flipside - liquid","mouz - hr"]
[null,"Sous total",null,{"$f":"'Data EL'!D23","v":18},{"$f":"'Data EL'!E23","v":12},{"$f":"'Data EL'!F23","v":15},{"$f":"'Data EL'!G23","v":21},{"$f":"'Data EL'!H23","v":21},{"$f":"'Data EL'!I23","v":21},{"$f":"'Data EL'!J23","v":0},{"$f":"'Data EL'!K23","v":21},{"$f":"'Data EL'!L23","v":18},{"$f":"'Data EL'!M23","v":0},{"$f":"'Data EL'!N23","v":15},{"$f":"'Data EL'!O23","v":18},{"$f":"'Data EL'!P23","v":21},{"$f":"'Data EL'!Q23","v":21},{"$f":"'Data EL'!R23","v":0}]
["Jour 3","mouz - fnatic","fnatic","fnatic","mouz","fnatic","mouz","mouz","fnatic",null,"fnatic","fnatic",null,"fnatic","mouz","fnatic","mouz"]
[null,"godsent - nv","nv","nv","nv","godsent","godsent","godsent","godsent",null,"godsent","godsent",null,"nv","godsent","godsent","godsent"]
[null,"north - hr","north","north","hr","north","hr","north","north",null,"north","north",null,"north","north","north","north"]
[null,"gambit - vp","vp","vp","vp","vp","vp","gambit","vp",null,"vp","vp",null,"vp","vp","vp","gambit"]
[null,"astralis - g2","astralis","astralis","astralis","g2","g2","g2","g2",null,"g2","astralis",null,"astralis","astralis","g2","astralis"]
[null,"sk - navi","navi","sk","navi","sk","navi","navi","navi",null,"sk","navi",null,"sk","navi","navi","sk"]
[null,"liquid - faze","/","faze","faze","faze","liquid","faze","faze",null,"faze","faze",null,"faze","faze","faze","faze"]
[null,"flipside - optic","/","optic","flipside","flipside","optic","optic","optic",null,"optic","optic",null,"optic","optic","optic","optic"]
["bonus du jour","close","/","sk - navi","godsent - nv","flipside - optic","liquid - faze","gambit - vp","astralis - g2",null,"sk - navi","gambit - vp",null,"sk - navi","liquid - faze","sk - navi","gambit - vp"]
[null,"Sous total",null,{"$f":"'Data EL'!D33","v":15},{"$f":"'Data EL'!E33","v":12},{"$f":"'Data EL'!F33","v":9},{"$f":"'Data EL'!G33","v":6},{"$f":"'Data EL'!H33","v":6},{"$f":"'Data EL'!I33","v":12},{"$f":"'Data EL'!J33","v":0},{"$f":"'Data EL'!K33","v":9},{"$f":"'Data EL'!L33","v":15},{"$f":"'Data EL'!M33","v":0},{"$f":"'Data EL'!N33","v":15},{"$f":"'Data EL'!O33","v":12},{"$f":"'Data EL'!P33","v":12},{"$f":"'Data EL'!Q33","v":6},{"$f":"'Data EL'!R33","v":0}]
["Jour 4","north - g2","north","g2","north","g2",null,"g2","g2",null,"g2","g2",null,"north","north","g2","g2"]
[null,"nv - fnatic","fnatic","nv","nv","nv",null,"nv","nv",null,"nv","nv",null,"fnatic","fnatic","fnatic","nv"]
[null,"mouz - liquid","liquid","liquid","mouz","liquid",null,"mouz","liquid",null,"liquid","liquid",null,"mouz","liquid","liquid","liquid"]
[null,"godsent - optic","godsent","optic","godsent","godsent",null,"godsent","optic",null,"optic","optic",null,"optic","optic","godsent","optic"]
[null,"sk - astralis","sk","astralis","sk","sk",null,"astralis","astralis",null,"astralis","astralis",null,"sk","astralis","sk","astralis"]
[null,"gambit - faze","faze","faze","gambit","faze",null,"gambit","faze",null,"faze","faze",null,"faze","faze","faze","faze"]
[null,null,"/"]
[null,null,"/"]
["bonus du jour","team  fr playoffs",0,2,1,0,"-",2,2,"-",1,1,"-",0,1,1,"-","-"]
[null,"Sous total",null,{"$f":"'Data EL'!D43","v":6},{"$f":"'Data EL'!E43","v":9},{"$f":"'Data EL'!F43","v":14},{"$f":"'Data EL'!G43","v":0},{"$f":"'Data EL'!H43","v":3},{"$f":"'Data EL'!I43","v":6},{"$f":"'Data EL'!J43","v":0},{"$f":"'Data EL'!K43","v":6},{"$f":"'Data EL'!L43","v":6},{"$f":"'Data EL'!M43","v":0},{"$f":"'Data EL'!N43","v":14},{"$f":"'Data EL'!O43","v":12},{"$f":"'Data EL'!P43","v":15},{"$f":"'Data EL'!Q43","v":6},{"$f":"'Data EL'!R43","v":0}]
["Jour 5",null,"/"]
[null,null,"/"]
[null,null,"/"]
[null,null,"/"]
[null,null,"/"]
[null,null,"/"]
[null,null,"/"]
[null,null,"/"]
["bonus du jour",null,"/"]
[null,"Sous total",null,{"$f":"'Data EL'!D53","v":0},{"$f":"'Data EL'!E53","v":0},{"$f":"'Data EL'!F53","v":0},{"$f":"'Data EL'!G53","v":0},{"$f":"'Data EL'!H53","v":0},{"$f":"'Data EL'!I53","v":0},{"$f":"'Data EL'!J53","v":0},{"$f":"'Data EL'!K53","v":0},{"$f":"'Data EL'!L53","v":0},{"$f":"'Data EL'!M53","v":0},{"$f":"'Data EL'!N53","v":0},{"$f":"'Data EL'!O53","v":0},{"$f":"'Data EL'!P53","v":0},{"$f":"'Data EL'!Q53","v":0},{"$f":"'Data EL'!R53","v":0}]
[null,"total groupes",null,{"$f":"D14+D24+D34+D44+D54","v":51},{"$f":"E14+E24+E34+E44+E54","v":45},50,42,51,57,15,51,54,18,59,57,66,48,0]
["Quarts de finales"]
["navi","astralis","1 - 2","2 - 1",null,"2 - 0",null,"2 - 1","2 - 0",null,"2 - 0","2 - 1",null,"2 - 1","1 - 2","2 - 1","2 - 1"]
["gambit","fnatic","1 - 2","0 - 2",null,"2 - 0",null,"2 - 1","2 - 1",null,"2 - 1","2 - 0",null,"2 - 1","1 - 2","2 - 1","2 - 0"]
["vp","north","2 - 1","2 - 0",null,"2 - 0",null,"2 - 1","2 - 0",null,"2 - 1","2 - 0",null,"2 - 1","2 - 1","2 - 1","2 - 1"]
["faze","sk","1 - 2","2 - 1",null,"0 - 2",null,"2 - 1","2 - 1",null,"1 - 2","2 - 1",null,"1 - 2","2 - 1","0 - 2","1 - 2"]
["Bottomfraggers",null,"edward","seized",null,"kjaerbye",null,"device","glaive",null,"glaive","seized",null,"xyp9x","edward","glaive","glaive"]
[null,null,"dosia","zeus",null,"krimz",null,"twist","adren",null,"disco","disco",null,"disco","disco","disco","disco"]
[null,null,"taz/byali","msl",null,"cajunb",null,"msl","msl",null,"msl","msl",null,"msl","msl","msl","msl"]
[null,null,"rain","allu",null,"kio",null,"fox","aizy",null,"aizy","fox",null,"aizy","fox","aizy","aizy"]
["total 1/4 de finales",null,null,8,{"$f":"SUM(Data!C72:C75)+SUM(Data!C82:C82)","v":0},8,{"$f":"SUM(Data!E72:E75)+SUM(Data!E82:E82)","v":0},6,4,{"$f":"SUM(Data!H72:H75)+SUM(Data!H82:H82)","v":0},12,4,{"$f":"SUM(Data!K72:K75)+SUM(Data!K82:K82)","v":0},12,18,10,12,{"$f":"SUM(Data!P72:P75)+SUM(Data!P82:P82)","v":0}]
[]
["demies finales"]
["astralis","fnatic","2 - 0","2 - 0",null,"0 - 2",null,"2 - 1","2 - 0",null,"2 - 1","2 - 0",null,"2 - 1","2 - 1","2 - 0"]
["vp","sk","2 - 0","0 - 2",null,"2 - 0",null,"2 - 1","1 - 2",null,"2 - 1","2 - 0",null,"1 - 2","2 - 1","1 - 2"]
["topfraggers",null,"krimz","device",null,"olof",null,"kjaerbye","device",null,"device","device",null,"device","device","device"]
[null,null,"taz/cold","cold",null,"byali",null,"snax","fer",null,"neo","snax",null,"cold","snax","cold"]
["total 1/2 finale",null,null,9,{"$f":"SUM(Data!C79:C80)+Data!C86","v":0},7,{"$f":"SUM(Data!E79:E80)+Data!E86","v":0},10,7,{"$f":"SUM(Data!H79:H80)+Data!H86","v":0},10,14,{"$f":"SUM(Data!K79:K80)+Data!K86","v":0},7,10,9,{"$f":"SUM(Data!O79:O80)+Data!O86","v":0},{"$f":"SUM(Data!P79:P80)+Data!P86","v":0}]
[]
["finale"]
["astralis","vp","0 - 0","2 - 0",null,"0 - 2",null,"1 - 2","1 - 2",null,"1 - 2","2 - 1",null,"0 - 2","2 - 1","1 - 2"]
["topfragger",null,"snax","device",null,"taz",null,null,"snax",null,"snax","device",null,"device","device","device"]
[2,null,"kjaerbye","snax",null,"device",null,null,"device",null,"taz","snax",null,"snax","snax","snax"]
[3,null,"byali","kjaerbye",null,"snax",null,null,"taz",null,"device","kjaerbye",null,"pasha","dupreeh","taz"]
["bonus top fragger",null,null,2,null,2,null,0,3,null,3,4,null,2,2,2]
["total finale",null,null,8,null,2,null,0,3,null,3,13,null,2,11,2]
[]
[null,"total",null,{"$f":"D55+D65+D4+D72+D80","v":76},{"$f":"E55+E65+E4+E72+E80","v":50},67,42,72,71,15,76,95,23,80,101,92,65,0]

{"sheet":"Data EL","index":5,"n_rows":56,"n_cols":38,"rows_kept":56,"cut":false,"hidden":false,"merged":[]}
[null,null,null,"Jazz","doyL","Epicier","darks","Lema","Passi","edia","budo","peRf","shogoki","douzer","ventur","Kevnay","Neo","Nico",null,null,null,null,null,null,null,null,null,null,null,null,null,null,null,null,null,null,"Joueur","Points"]
["Bonus","Vainqueur Major",null,null,null,null,null,null,null,null,null,null,null,null,null,null,null,null,null,null,null,null,null,null,null,null,null,null,null,null,null,null,null,null,null,null,{"$f":"ELEAGUE!O1","v":"ventur"},{"$f":"ELEAGUE!O82","v":101}]
[null,"Vainqueur FFF",null,null,null,null,null,null,null,null,null,null,null,null,null,null,null,null,null,null,null,null,null,null,null,null,null,null,null,null,null,null,null,null,null,null,{"$f":"ELEAGUE!L1","v":"peRf"},{"$f":"ELEAGUE!L82","v":95}]
["Jour 1","gambit - north","gambit",{"$f":"IF(ELEAGUE!D5=ELEAGUE!$C5,3,0)","v":0},{"$f":"IF(ELEAGUE!E5=ELEAGUE!$C5,3,0)","v":0},{"$f":"IF(ELEAGUE!F5=ELEAGUE!$C5,3,0)","v":3},{"$f":"IF(ELEAGUE!G5=ELEAGUE!$C5,3,0)","v":0},{"$f":"IF(ELEAGUE!H5=ELEAGUE!$C5,3,0)","v":3},{"$f":"IF(ELEAGUE!I5=ELEAGUE!$C5,3,0)","v":3},{"$f":"IF(ELEAGUE!J5=ELEAGUE!$C5,3,0)","v":3},{"$f":"IF(ELEAGUE!K5=ELEAGUE!$C5,3,0)","v":0},{"$f":"IF(ELEAGUE!L5=ELEAGUE!$C5,3,0)","v":0},{"$f":"IF(ELEAGUE!M5=ELEAGUE!$C5,3,0)","v":0},{"$f":"IF(ELEAGUE!N5=ELEAGUE!$C5,3,0)","v":0},{"$f":"IF(ELEAGUE!O5=ELEAGUE!$C5,3,0)","v":3},{"$f":"IF(ELEAGUE!P5=ELEAGUE!$C5,3,0)","v":0},{"$f":"IF(ELEAGUE!Q5=ELEAGUE!$C5,3,0)","v":0},{"$f":"IF(ELEAGUE!R5=ELEAGUE!$C5,3,0)","v":0},null,null,null,null,null,null,null,null,null,null,null,null,null,null,null,null,null,null,{"$f":"ELEAGUE!P1","v":"Kevnay"},{"$f":"ELEAGUE!P82","v":92}]
[null,"fnatic - g2","g2",{"$f":"IF(ELEAGUE!D6=ELEAGUE!$C6,3,0)","v":0},{"$f":"IF(ELEAGUE!E6=ELEAGUE!$C6,3,0)","v":3},{"$f":"IF(ELEAGUE!F6=ELEAGUE!$C6,3,0)","v":3},{"$f":"IF(ELEAGUE!G6=ELEAGUE!$C6,3,0)","v":3},{"$f":"IF(ELEAGUE!H6=ELEAGUE!$C6,3,0)","v":3},{"$f":"IF(ELEAGUE!I6=ELEAGUE!$C6,3,0)","v":3},{"$f":"IF(ELEAGUE!J6=ELEAGUE!$C6,3,0)","v":0},{"$f":"IF(ELEAGUE!K6=ELEAGUE!$C6,3,0)","v":3},{"$f":"IF(ELEAGUE!L6=ELEAGUE!$C6,3,0)","v":0},{"$f":"IF(ELEAGUE!M6=ELEAGUE!$C6,3,0)","v":3},{"$f":"IF(ELEAGUE!N6=ELEAGUE!$C6,3,0)","v":0},{"$f":"IF(ELEAGUE!O6=ELEAGUE!$C6,3,0)","v":0},{"$f":"IF(ELEAGUE!P6=ELEAGUE!$C6,3,0)","v":3},{"$f":"IF(ELEAGUE!Q6=ELEAGUE!$C6,3,0)","v":0},{"$f":"IF(ELEAGUE!R6=ELEAGUE!$C6,3,0)","v":0},null,null,null,null,null,null,null,null,null,null,null,null,null,null,null,null,null,null,{"$f":"ELEAGUE!N1","v":"douzer"},{"$f":"ELEAGUE!N82","v":80}]
[null,"sk - hr","sk",{"$f":"IF(ELEAGUE!D7=ELEAGUE!$C7,3,0)","v":3},{"$f":"IF(ELEAGUE!E7=ELEAGUE!$C7,3,0)","v":0},{"$f":"IF(ELEAGUE!F7=ELEAGUE!$C7,3,0)","v":0},{"$f":"IF(ELEAGUE!G7=ELEAGUE!$C7,3,0)","v":3},{"$f":"IF(ELEAGUE!H7=ELEAGUE!$C7,3,0)","v":3},{"$f":"IF(ELEAGUE!I7=ELEAGUE!$C7,3,0)","v":3},{"$f":"IF(ELEAGUE!J7=ELEAGUE!$C7,3,0)","v":3},{"$f":"IF(ELEAGUE!K7=ELEAGUE!$C7,3,0)","v":3},{"$f":"IF(ELEAGUE!L7=ELEAGUE!$C7,3,0)","v":3},{"$f":"IF(ELEAGUE!M7=ELEAGUE!$C7,3,0)","v":3},{"$f":"IF(ELEAGUE!N7=ELEAGUE!$C7,3,0)","v":3},{"$f":"IF(ELEAGUE!O7=ELEAGUE!$C7,3,0)","v":3},{"$f":"IF(ELEAGUE!P7=ELEAGUE!$C7,3,0)","v":3},{"$f":"IF(ELEAGUE!Q7=ELEAGUE!$C7,3,0)","v":3},{"$f":"IF(ELEAGUE!R7=ELEAGUE!$C7,3,0)","v":0},null,null,null,null,null,null,null,null,null,null,null,null,null,null,null,null,null,null,{"$f":"ELEAGUE!D1","v":"Jazz"},{"$f":"ELEAGUE!D82","v":76}]
[null,"vp - optic","vp",{"$f":"IF(ELEAGUE!D8=ELEAGUE!$C8,3,0)","v":0},{"$f":"IF(ELEAGUE!E8=ELEAGUE!$C8,3,0)","v":3},{"$f":"IF(ELEAGUE!F8=ELEAGUE!$C8,3,0)","v":3},{"$f":"IF(ELEAGUE!G8=ELEAGUE!$C8,3,0)","v":0},{"$f":"IF(ELEAGUE!H8=ELEAGUE!$C8,3,0)","v":3},{"$f":"IF(ELEAGUE!I8=ELEAGUE!$C8,3,0)","v":3},{"$f":"IF(ELEAGUE!J8=ELEAGUE!$C8,3,0)","v":0},{"$f":"IF(ELEAGUE!K8=ELEAGUE!$C8,3,0)","v":3},{"$f":"IF(ELEAGUE!L8=ELEAGUE!$C8,3,0)","v":3},{"$f":"IF(ELEAGUE!M8=ELEAGUE!$C8,3,0)","v":3},{"$f":"IF(ELEAGUE!N8=ELEAGUE!$C8,3,0)","v":3},{"$f":"IF(ELEAGUE!O8=ELEAGUE!$C8,3,0)","v":0},{"$f":"IF(ELEAGUE!P8=ELEAGUE!$C8,3,0)","v":3},{"$f":"IF(ELEAGUE!Q8=ELEAGUE!$C8,3,0)","v":3},{"$f":"IF(ELEAGUE!R8=ELEAGUE!$C8,3,0)","v":0},null,null,null,null,null,null,null,null,null,null,null,null,null,null,null,null,null,null,{"$f":"ELEAGUE!K1","v":"budo"},{"$f":"ELEAGUE!K82","v":76}]
[null,"navi - mouz","navi",{"$f":"IF(ELEAGUE!D9=ELEAGUE!$C9,3,0)","v":3},{"$f":"IF(ELEAGUE!E9=ELEAGUE!$C9,3,0)","v":0},{"$f":"IF(ELEAGUE!F9=ELEAGUE!$C9,3,0)","v":0},{"$f":"IF(ELEAGUE!G9=ELEAGUE!$C9,3,0)","v":3},{"$f":"IF(ELEAGUE!H9=ELEAGUE!$C9,3,0)","v":3},{"$f":"IF(ELEAGUE!I9=ELEAGUE!$C9,3,0)","v":3},{"$f":"IF(ELEAGUE!J9=ELEAGUE!$C9,3,0)","v":3},{"$f":"IF(ELEAGUE!K9=ELEAGUE!$C9,3,0)","v":3},{"$f":"IF(ELEAGUE!L9=ELEAGUE!$C9,3,0)","v":3},{"$f":"IF(ELEAGUE!M9=ELEAGUE!$C9,3,0)","v":3},{"$f":"IF(ELEAGUE!N9=ELEAGUE!$C9,3,0)","v":3},{"$f":"IF(ELEAGUE!O9=ELEAGUE!$C9,3,0)","v":3},{"$f":"IF(ELEAGUE!P9=ELEAGUE!$C9,3,0)","v":3},{"$f":"IF(ELEAGUE!Q9=ELEAGUE!$C9,3,0)","v":3},{"$f":"IF(ELEAGUE!R9=ELEAGUE!$C9,3,0)","v":0},null,null,null,null,null,null,null,null,null,null,null,null,null,null,null,null,null,null,{"$f":"ELEAGUE!H1","v":"Lema"},{"$f":"ELEAGUE!H82","v":72}]
[null,"liquid - nv","nv",{"$f":"IF(ELEAGUE!D10=ELEAGUE!$C10,3,0)","v":3},{"$f":"IF(ELEAGUE!E10=ELEAGUE!$C10,3,0)","v":3},{"$f":"IF(ELEAGUE!F10=ELEAGUE!$C10,3,0)","v":3},{"$f":"IF(ELEAGUE!G10=ELEAGUE!$C10,3,0)","v":0},{"$f":"IF(ELEAGUE!H10=ELEAGUE!$C10,3,0)","v":3},{"$f":"IF(ELEAGUE!I10=ELEAGUE!$C10,3,0)","v":0},{"$f":"IF(ELEAGUE!J10=ELEAGUE!$C10,3,0)","v":3},{"$f":"IF(ELEAGUE!K10=ELEAGUE!$C10,3,0)","v":0},{"$f":"IF(ELEAGUE!L10=ELEAGUE!$C10,3,0)","v":3},{"$f":"IF(ELEAGUE!M10=ELEAGUE!$C10,3,0)","v":3},{"$f":"IF(ELEAGUE!N10=ELEAGUE!$C10,3,0)","v":3},{"$f":"IF(ELEAGUE!O10=ELEAGUE!$C10,3,0)","v":3},{"$f":"IF(ELEAGUE!P10=ELEAGUE!$C10,3,0)","v":3},{"$f":"IF(ELEAGUE!Q10=ELEAGUE!$C10,3,0)","v":3},{"$f":"IF(ELEAGUE!R10=ELEAGUE!$C10,3,0)","v":0},null,null,null,null,null,null,null,null,null,null,null,null,null,null,null,null,null,null,{"$f":"ELEAGUE!I1","v":"Cpassimal"},{"$f":"ELEAGUE!I82","v":71}]
[null,"astralis - godsent","godsent",{"$f":"IF(ELEAGUE!D11=ELEAGUE!$C11,3,0)","v":0},{"$f":"IF(ELEAGUE!E11=ELEAGUE!$C11,3,0)","v":0},{"$f":"IF(ELEAGUE!F11=ELEAGUE!$C11,3,0)","v":0},{"$f":"IF(ELEAGUE!G11=ELEAGUE!$C11,3,0)","v":3},{"$f":"IF(ELEAGUE!H11=ELEAGUE!$C11,3,0)","v":0},{"$f":"IF(ELEAGUE!I11=ELEAGUE!$C11,3,0)","v":0},{"$f":"IF(ELEAGUE!J11=ELEAGUE!$C11,3,0)","v":0},{"$f":"IF(ELEAGUE!K11=ELEAGUE!$C11,3,0)","v":0},{"$f":"IF(ELEAGUE!L11=ELEAGUE!$C11,3,0)","v":0},{"$f":"IF(ELEAGUE!M11=ELEAGUE!$C11,3,0)","v":0},{"$f":"IF(ELEAGUE!N11=ELEAGUE!$C11,3,0)","v":0},{"$f":"IF(ELEAGUE!O11=ELEAGUE!$C11,3,0)","v":0},{"$f":"IF(ELEAGUE!P11=ELEAGUE!$C11,3,0)","v":0},{"$f":"IF(ELEAGUE!Q11=ELEAGUE!$C11,3,0)","v":0},{"$f":"IF(ELEAGUE!R11=ELEAGUE!$C11,3,0)","v":0},null,null,null,null,null,null,null,null,null,null,null,null,null,null,null,null,null,null,{"$f":"ELEAGUE!F1","v":"Epicier"},{"$f":"ELEAGUE!F82","v":67}]
[null,"f3 - faze","faze",{"$f":"IF(ELEAGUE!D12=ELEAGUE!$C12,3,0)","v":3},{"$f":"IF(ELEAGUE!E12=ELEAGUE!$C12,3,0)","v":3},{"$f":"IF(ELEAGUE!F12=ELEAGUE!$C12,3,0)","v":0},{"$f":"IF(ELEAGUE!G12=ELEAGUE!$C12,3,0)","v":3},{"$f":"IF(ELEAGUE!H12=ELEAGUE!$C12,3,0)","v":3},{"$f":"IF(ELEAGUE!I12=ELEAGUE!$C12,3,0)","v":3},{"$f":"IF(ELEAGUE!J12=ELEAGUE!$C12,3,0)","v":3},{"$f":"IF(ELEAGUE!K12=ELEAGUE!$C12,3,0)","v":3},{"$f":"IF(ELEAGUE!L12=ELEAGUE!$C12,3,0)","v":3},{"$f":"IF(ELEAGUE!M12=ELEAGUE!$C12,3,0)","v":3},{"$f":"IF(ELEAGUE!N12=ELEAGUE!$C12,3,0)","v":3},{"$f":"IF(ELEAGUE!O12=ELEAGUE!$C12,3,0)","v":3},{"$f":"IF(ELEAGUE!P12=ELEAGUE!$C12,3,0)","v":3},{"$f":"IF(ELEAGUE!Q12=ELEAGUE!$C12,3,0)","v":3},{"$f":"IF(ELEAGUE!R12=ELEAGUE!$C12,3,0)","v":0},null,null,null,null,null,null,null,null,null,null,null,null,null,null,null,null,null,null,{"$f":"ELEAGUE!Q1","v":"Neo"},{"$f":"ELEAGUE!Q82","v":65}]
["bonus du jour","-","-",{"$f":"IF(ELEAGUE!D13=ELEAGUE!$C13,3,0)","v":0},{"$f":"IF(ELEAGUE!E13=ELEAGUE!$C13,3,0)","v":0},{"$f":"IF(ELEAGUE!F13=ELEAGUE!$C13,3,0)","v":0},{"$f":"IF(ELEAGUE!G13=ELEAGUE!$C13,3,0)","v":0},{"$f":"IF(ELEAGUE!H13=ELEAGUE!$C13,3,0)","v":0},{"$f":"IF(ELEAGUE!I13=ELEAGUE!$C13,3,0)","v":0},{"$f":"IF(ELEAGUE!J13=ELEAGUE!$C13,3,0)","v":0},{"$f":"IF(ELEAGUE!K13=ELEAGUE!$C13,3,0)","v":0},{"$f":"IF(ELEAGUE!L13=ELEAGUE!$C13,3,0)","v":0},{"$f":"IF(ELEAGUE!M13=ELEAGUE!$C13,3,0)","v":0},{"$f":"IF(ELEAGUE!N13=ELEAGUE!$C13,3,0)","v":0},{"$f":"IF(ELEAGUE!O13=ELEAGUE!$C13,3,0)","v":0},{"$f":"IF(ELEAGUE!P13=ELEAGUE!$C13,3,0)","v":0},{"$f":"IF(ELEAGUE!Q13=ELEAGUE!$C13,3,0)","v":0},{"$f":"IF(ELEAGUE!R13=ELEAGUE!$C13,3,0)","v":0},null,null,null,null,null,null,null,null,null,null,null,null,null,null,null,null,null,null,{"$f":"ELEAGUE!E1","v":"doyL"},{"$f":"ELEAGUE!E82","v":50}]
[null,"Sous total",null,{"$f":"SUM(D4:D12)","v":12},{"$f":"SUM(E4:E12)","v":12},12,15,21,18,15,15,15,18,15,15,18,15,0,null,null,null,null,null,null,null,null,null,null,null,null,null,null,null,null,null,null,{"$f":"ELEAGUE!G1","v":"darks"},{"$f":"ELEAGUE!G82","v":42}]
["Jour 2",null,null,{"$f":"IF(ELEAGUE!D15=ELEAGUE!$C15,3,0)","v":3},{"$f":"IF(ELEAGUE!E15=ELEAGUE!$C15,3,0)","v":3},{"$f":"IF(ELEAGUE!F15=ELEAGUE!$C15,3,0)","v":3},{"$f":"IF(ELEAGUE!G15=ELEAGUE!$C15,3,0)","v":3},{"$f":"IF(ELEAGUE!H15=ELEAGUE!$C15,3,0)","v":3},{"$f":"IF(ELEAGUE!I15=ELEAGUE!$C15,3,0)","v":3},{"$f":"IF(ELEAGUE!J15=ELEAGUE!$C15,3,0)","v":0},{"$f":"IF(ELEAGUE!K15=ELEAGUE!$C15,3,0)","v":3},{"$f":"IF(ELEAGUE!L15=ELEAGUE!$C15,3,0)","v":3},{"$f":"IF(ELEAGUE!M15=ELEAGUE!$C15,3,0)","v":0},{"$f":"IF(ELEAGUE!N15=ELEAGUE!$C15,3,0)","v":3},{"$f":"IF(ELEAGUE!O15=ELEAGUE!$C15,3,0)","v":3},{"$f":"IF(ELEAGUE!P15=ELEAGUE!$C15,3,0)","v":3},{"$f":"IF(ELEAGUE!Q15=ELEAGUE!$C15,3,0)","v":3},{"$f":"IF(ELEAGUE!R15=ELEAGUE!$C15,3,0)","v":0},null,null,null,null,null,null,null,null,null,null,null,null,null,null,null,null,null,null,{"$f":"ELEAGUE!M1","v":"shogoki"},{"$f":"ELEAGUE!M82","v":23}]
[null,null,null,{"$f":"IF(ELEAGUE!D16=ELEAGUE!$C16,3,0)","v":3},{"$f":"IF(ELEAGUE!E16=ELEAGUE!$C16,3,0)","v":0},{"$f":"IF(ELEAGUE!F16=ELEAGUE!$C16,3,0)","v":3},{"$f":"IF(ELEAGUE!G16=ELEAGUE!$C16,3,0)","v":3},{"$f":"IF(ELEAGUE!H16=ELEAGUE!$C16,3,0)","v":3},{"$f":"IF(ELEAGUE!I16=ELEAGUE!$C16,3,0)","v":3},{"$f":"IF(ELEAGUE!J16=ELEAGUE!$C16,3,0)","v":0},{"$f":"IF(ELEAGUE!K16=ELEAGUE!$C16,3,0)","v":3},{"$f":"IF(ELEAGUE!L16=ELEAGUE!$C16,3,0)","v":3},{"$f":"IF(ELEAGUE!M16=ELEAGUE!$C16,3,0)","v":0},{"$f":"IF(ELEAGUE!N16=ELEAGUE!$C16,3,0)","v":3},{"$f":"IF(ELEAGUE!O16=ELEAGUE!$C16,3,0)","v":3},{"$f":"IF(ELEAGUE!P16=ELEAGUE!$C16,3,0)","v":3},{"$f":"IF(ELEAGUE!Q16=ELEAGUE!$C16,3,0)","v":3},{"$f":"IF(ELEAGUE!R16=ELEAGUE!$C16,3,0)","v":0},null,null,null,null,null,null,null,null,null,null,null,null,null,null,null,null,null,null,{"$f":"ELEAGUE!J1","v":"edia"},{"$f":"ELEAGUE!J82","v":15}]
[null,null,null,{"$f":"IF(ELEAGUE!D17=ELEAGUE!$C17,3,0)","v":0},{"$f":"IF(ELEAGUE!E17=ELEAGUE!$C17,3,0)","v":0},{"$f":"IF(ELEAGUE!F17=ELEAGUE!$C17,3,0)","v":3},{"$f":"IF(ELEAGUE!G17=ELEAGUE!$C17,3,0)","v":3},{"$f":"IF(ELEAGUE!H17=ELEAGUE!$C17,3,0)","v":3},{"$f":"IF(ELEAGUE!I17=ELEAGUE!$C17,3,0)","v":3},{"$f":"IF(ELEAGUE!J17=ELEAGUE!$C17,3,0)","v":0},{"$f":"IF(ELEAGUE!K17=ELEAGUE!$C17,3,0)","v":3},{"$f":"IF(ELEAGUE!L17=ELEAGUE!$C17,3,0)","v":3},{"$f":"IF(ELEAGUE!M17=ELEAGUE!$C17,3,0)","v":0},{"$f":"IF(ELEAGUE!N17=ELEAGUE!$C17,3,0)","v":3},{"$f":"IF(ELEAGUE!O17=ELEAGUE!$C17,3,0)","v":0},{"$f":"IF(ELEAGUE!P17=ELEAGUE!$C17,3,0)","v":3},{"$f":"IF(ELEAGUE!Q17=ELEAGUE!$C17,3,0)","v":3},{"$f":"IF(ELEAGUE!R17=ELEAGUE!$C17,3,0)","v":0}]
[null,null,null,{"$f":"IF(ELEAGUE!D18=ELEAGUE!$C18,3,0)","v":3},{"$f":"IF(ELEAGUE!E18=ELEAGUE!$C18,3,0)","v":3},{"$f":"IF(ELEAGUE!F18=ELEAGUE!$C18,3,0)","v":0},{"$f":"IF(ELEAGUE!G18=ELEAGUE!$C18,3,0)","v":3},{"$f":"IF(ELEAGUE!H18=ELEAGUE!$C18,3,0)","v":3},{"$f":"IF(ELEAGUE!I18=ELEAGUE!$C18,3,0)","v":3},{"$f":"IF(ELEAGUE!J18=ELEAGUE!$C18,3,0)","v":0},{"$f":"IF(ELEAGUE!K18=ELEAGUE!$C18,3,0)","v":3},{"$f":"IF(ELEAGUE!L18=ELEAGUE!$C18,3,0)","v":3},{"$f":"IF(ELEAGUE!M18=ELEAGUE!$C18,3,0)","v":0},{"$f":"IF(ELEAGUE!N18=ELEAGUE!$C18,3,0)","v":0},{"$f":"IF(ELEAGUE!O18=ELEAGUE!$C18,3,0)","v":3},{"$f":"IF(ELEAGUE!P18=ELEAGUE!$C18,3,0)","v":3},{"$f":"IF(ELEAGUE!Q18=ELEAGUE!$C18,3,0)","v":0},{"$f":"IF(ELEAGUE!R18=ELEAGUE!$C18,3,0)","v":0}]
[null,null,null,{"$f":"IF(ELEAGUE!D19=ELEAGUE!$C19,3,0)","v":3},{"$f":"IF(ELEAGUE!E19=ELEAGUE!$C19,3,0)","v":3},{"$f":"IF(ELEAGUE!F19=ELEAGUE!$C19,3,0)","v":3},{"$f":"IF(ELEAGUE!G19=ELEAGUE!$C19,3,0)","v":3},{"$f":"IF(ELEAGUE!H19=ELEAGUE!$C19,3,0)","v":3},{"$f":"IF(ELEAGUE!I19=ELEAGUE!$C19,3,0)","v":3},{"$f":"IF(ELEAGUE!J19=ELEAGUE!$C19,3,0)","v":0},{"$f":"IF(ELEAGUE!K19=ELEAGUE!$C19,3,0)","v":3},{"$f":"IF(ELEAGUE!L19=ELEAGUE!$C19,3,0)","v":3},{"$f":"IF(ELEAGUE!M19=ELEAGUE!$C19,3,0)","v":0},{"$f":"IF(ELEAGUE!N19=ELEAGUE!$C19,3,0)","v":3},{"$f":"IF(ELEAGUE!O19=ELEAGUE!$C19,3,0)","v":3},{"$f":"IF(ELEAGUE!P19=ELEAGUE!$C19,3,0)","v":3},{"$f":"IF(ELEAGUE!Q19=ELEAGUE!$C19,3,0)","v":3},{"$f":"IF(ELEAGUE!R19=ELEAGUE!$C19,3,0)","v":0}]
[null,null,null,{"$f":"IF(ELEAGUE!D20=ELEAGUE!$C20,3,0)","v":0},{"$f":"IF(ELEAGUE!E20=ELEAGUE!$C20,3,0)","v":3},{"$f":"IF(ELEAGUE!F20=ELEAGUE!$C20,3,0)","v":3},{"$f":"IF(ELEAGUE!G20=ELEAGUE!$C20,3,0)","v":3},{"$f":"IF(ELEAGUE!H20=ELEAGUE!$C20,3,0)","v":3},{"$f":"IF(ELEAGUE!I20=ELEAGUE!$C20,3,0)","v":3},{"$f":"IF(ELEAGUE!J20=ELEAGUE!$C20,3,0)","v":0},{"$f":"IF(ELEAGUE!K20=ELEAGUE!$C20,3,0)","v":3},{"$f":"IF(ELEAGUE!L20=ELEAGUE!$C20,3,0)","v":3},{"$f":"IF(ELEAGUE!M20=ELEAGUE!$C20,3,0)","v":0},{"$f":"IF(ELEAGUE!N20=ELEAGUE!$C20,3,0)","v":0},{"$f":"IF(ELEAGUE!O20=ELEAGUE!$C20,3,0)","v":3},{"$f":"IF(ELEAGUE!P20=ELEAGUE!$C20,3,0)","v":3},{"$f":"IF(ELEAGUE!Q20=ELEAGUE!$C20,3,0)","v":3},{"$f":"IF(ELEAGUE!R20=ELEAGUE!$C20,3,0)","v":0}]
[null,null,null,{"$f":"IF(ELEAGUE!D21=ELEAGUE!$C21,3,0)","v":0},{"$f":"IF(ELEAGUE!E21=ELEAGUE!$C21,3,0)","v":0},{"$f":"IF(ELEAGUE!F21=ELEAGUE!$C21,3,0)","v":0},{"$f":"IF(ELEAGUE!G21=ELEAGUE!$C21,3,0)","v":3},{"$f":"IF(ELEAGUE!H21=ELEAGUE!$C21,3,0)","v":3},{"$f":"IF(ELEAGUE!I21=ELEAGUE!$C21,3,0)","v":0},{"$f":"IF(ELEAGUE!J21=ELEAGUE!$C21,3,0)","v":0},{"$f":"IF(ELEAGUE!K21=ELEAGUE!$C21,3,0)","v":0},{"$f":"IF(ELEAGUE!L21=ELEAGUE!$C21,3,0)","v":0},{"$f":"IF(ELEAGUE!M21=ELEAGUE!$C21,3,0)","v":0},{"$f":"IF(ELEAGUE!N21=ELEAGUE!$C21,3,0)","v":0},{"$f":"IF(ELEAGUE!O21=ELEAGUE!$C21,3,0)","v":0},{"$f":"IF(ELEAGUE!P21=ELEAGUE!$C21,3,0)","v":0},{"$f":"IF(ELEAGUE!Q21=ELEAGUE!$C21,3,0)","v":3},{"$f":"IF(ELEAGUE!R21=ELEAGUE!$C21,3,0)","v":0}]
[null,null,null,{"$f":"IF(ELEAGUE!D22=ELEAGUE!$C22,3,0)","v":3},{"$f":"IF(ELEAGUE!E22=ELEAGUE!$C22,3,0)","v":0},{"$f":"IF(ELEAGUE!F22=ELEAGUE!$C22,3,0)","v":0},{"$f":"IF(ELEAGUE!G22=ELEAGUE!$C22,3,0)","v":0},{"$f":"IF(ELEAGUE!H22=ELEAGUE!$C22,3,0)","v":0},{"$f":"IF(ELEAGUE!I22=ELEAGUE!$C22,3,0)","v":3},{"$f":"IF(ELEAGUE!J22=ELEAGUE!$C22,3,0)","v":0},{"$f":"IF(ELEAGUE!K22=ELEAGUE!$C22,3,0)","v":3},{"$f":"IF(ELEAGUE!L22=ELEAGUE!$C22,3,0)","v":0},{"$f":"IF(ELEAGUE!M22=ELEAGUE!$C22,3,0)","v":0},{"$f":"IF(ELEAGUE!N22=ELEAGUE!$C22,3,0)","v":3},{"$f":"IF(ELEAGUE!O22=ELEAGUE!$C22,3,0)","v":3},{"$f":"IF(ELEAGUE!P22=ELEAGUE!$C22,3,0)","v":3},{"$f":"IF(ELEAGUE!Q22=ELEAGUE!$C22,3,0)","v":3},{"$f":"IF(ELEAGUE!R22=ELEAGUE!$C22,3,0)","v":0}]
["bonus du jour",null,null,{"$f":"IF(ELEAGUE!D23=ELEAGUE!$C23,3,0)","v":3},{"$f":"IF(ELEAGUE!E23=ELEAGUE!$C23,3,0)","v":0},{"$f":"IF(ELEAGUE!F23=ELEAGUE!$C23,3,0)","v":0},{"$f":"IF(ELEAGUE!G23=ELEAGUE!$C23,3,0)","v":0},{"$f":"IF(ELEAGUE!H23=ELEAGUE!$C23,3,0)","v":0},{"$f":"IF(ELEAGUE!I23=ELEAGUE!$C23,3,0)","v":0},{"$f":"IF(ELEAGUE!J23=ELEAGUE!$C23,3,0)","v":0},{"$f":"IF(ELEAGUE!K23=ELEAGUE!$C23,3,0)","v":0},{"$f":"IF(ELEAGUE!L23=ELEAGUE!$C23,3,0)","v":0},{"$f":"IF(ELEAGUE!M23=ELEAGUE!$C23,3,0)","v":0},{"$f":"IF(ELEAGUE!N23=ELEAGUE!$C23,3,0)","v":0},{"$f":"IF(ELEAGUE!O23=ELEAGUE!$C23,3,0)","v":0},{"$f":"IF(ELEAGUE!P23=ELEAGUE!$C23,3,0)","v":0},{"$f":"IF(ELEAGUE!Q23=ELEAGUE!$C23,3,0)","v":0},{"$f":"IF(ELEAGUE!R23=ELEAGUE!$C23,3,0)","v":0}]
[null,"Sous total",null,{"$f":"SUM(D14:D22)","v":18},{"$f":"SUM(E14:E22)","v":12},{"$f":"SUM(F14:F22)","v":15},{"$f":"SUM(G14:G22)","v":21},{"$f":"SUM(H14:H22)","v":21},{"$f":"SUM(I14:I22)","v":21},{"$f":"SUM(J14:J22)","v":0},{"$f":"SUM(K14:K22)","v":21},{"$f":"SUM(L14:L22)","v":18},{"$f":"SUM(M14:M22)","v":0},{"$f":"SUM(N14:N22)","v":15},{"$f":"SUM(O14:O22)","v":18},{"$f":"SUM(P14:P22)","v":21},{"$f":"SUM(Q14:Q22)","v":21},{"$f":"SUM(R14:R22)","v":0}]
["Jour 3",null,null,{"$f":"IF(ELEAGUE!D25=ELEAGUE!$C25,3,0)","v":3},{"$f":"IF(ELEAGUE!E25=ELEAGUE!$C25,3,0)","v":0},{"$f":"IF(ELEAGUE!F25=ELEAGUE!$C25,3,0)","v":3},{"$f":"IF(ELEAGUE!G25=ELEAGUE!$C25,3,0)","v":0},{"$f":"IF(ELEAGUE!H25=ELEAGUE!$C25,3,0)","v":0},{"$f":"IF(ELEAGUE!I25=ELEAGUE!$C25,3,0)","v":3},{"$f":"IF(ELEAGUE!J25=ELEAGUE!$C25,3,0)","v":0},{"$f":"IF(ELEAGUE!K25=ELEAGUE!$C25,3,0)","v":3},{"$f":"IF(ELEAGUE!L25=ELEAGUE!$C25,3,0)","v":3},{"$f":"IF(ELEAGUE!M25=ELEAGUE!$C25,3,0)","v":0},{"$f":"IF(ELEAGUE!N25=ELEAGUE!$C25,3,0)","v":3},{"$f":"IF(ELEAGUE!O25=ELEAGUE!$C25,3,0)","v":0},{"$f":"IF(ELEAGUE!P25=ELEAGUE!$C25,3,0)","v":3},{"$f":"IF(ELEAGUE!Q25=ELEAGUE!$C25,3,0)","v":0},{"$f":"IF(ELEAGUE!R25=ELEAGUE!$C25,3,0)","v":0}]
[null,null,null,{"$f":"IF(ELEAGUE!D26=ELEAGUE!$C26,3,0)","v":3},{"$f":"IF(ELEAGUE!E26=ELEAGUE!$C26,3,0)","v":3},{"$f":"IF(ELEAGUE!F26=ELEAGUE!$C26,3,0)","v":0},{"$f":"IF(ELEAGUE!G26=ELEAGUE!$C26,3,0)","v":0},{"$f":"IF(ELEAGUE!H26=ELEAGUE!$C26,3,0)","v":0},{"$f":"IF(ELEAGUE!I26=ELEAGUE!$C26,3,0)","v":0},{"$f":"IF(ELEAGUE!J26=ELEAGUE!$C26,3,0)","v":0},{"$f":"IF(ELEAGUE!K26=ELEAGUE!$C26,3,0)","v":0},{"$f":"IF(ELEAGUE!L26=ELEAGUE!$C26,3,0)","v":0},{"$f":"IF(ELEAGUE!M26=ELEAGUE!$C26,3,0)","v":0},{"$f":"IF(ELEAGUE!N26=ELEAGUE!$C26,3,0)","v":3},{"$f":"IF(ELEAGUE!O26=ELEAGUE!$C26,3,0)","v":0},{"$f":"IF(ELEAGUE!P26=ELEAGUE!$C26,3,0)","v":0},{"$f":"IF(ELEAGUE!Q26=ELEAGUE!$C26,3,0)","v":0},{"$f":"IF(ELEAGUE!R26=ELEAGUE!$C26,3,0)","v":0}]
[null,null,null,{"$f":"IF(ELEAGUE!D27=ELEAGUE!$C27,3,0)","v":3},{"$f":"IF(ELEAGUE!E27=ELEAGUE!$C27,3,0)","v":0},{"$f":"IF(ELEAGUE!F27=ELEAGUE!$C27,3,0)","v":3},{"$f":"IF(ELEAGUE!G27=ELEAGUE!$C27,3,0)","v":0},{"$f":"IF(ELEAGUE!H27=ELEAGUE!$C27,3,0)","v":3},{"$f":"IF(ELEAGUE!I27=ELEAGUE!$C27,3,0)","v":3},{"$f":"IF(ELEAGUE!J27=ELEAGUE!$C27,3,0)","v":0},{"$f":"IF(ELEAGUE!K27=ELEAGUE!$C27,3,0)","v":3},{"$f":"IF(ELEAGUE!L27=ELEAGUE!$C27,3,0)","v":3},{"$f":"IF(ELEAGUE!M27=ELEAGUE!$C27,3,0)","v":0},{"$f":"IF(ELEAGUE!N27=ELEAGUE!$C27,3,0)","v":3},{"$f":"IF(ELEAGUE!O27=ELEAGUE!$C27,3,0)","v":3},{"$f":"IF(ELEAGUE!P27=ELEAGUE!$C27,3,0)","v":3},{"$f":"IF(ELEAGUE!Q27=ELEAGUE!$C27,3,0)","v":3},{"$f":"IF(ELEAGUE!R27=ELEAGUE!$C27,3,0)","v":0}]
[null,null,null,{"$f":"IF(ELEAGUE!D28=ELEAGUE!$C28,3,0)","v":3},{"$f":"IF(ELEAGUE!E28=ELEAGUE!$C28,3,0)","v":3},{"$f":"IF(ELEAGUE!F28=ELEAGUE!$C28,3,0)","v":3},{"$f":"IF(ELEAGUE!G28=ELEAGUE!$C28,3,0)","v":3},{"$f":"IF(ELEAGUE!H28=ELEAGUE!$C28,3,0)","v":0},{"$f":"IF(ELEAGUE!I28=ELEAGUE!$C28,3,0)","v":3},{"$f":"IF(ELEAGUE!J28=ELEAGUE!$C28,3,0)","v":0},{"$f":"IF(ELEAGUE!K28=ELEAGUE!$C28,3,0)","v":3},{"$f":"IF(ELEAGUE!L28=ELEAGUE!$C28,3,0)","v":3},{"$f":"IF(ELEAGUE!M28=ELEAGUE!$C28,3,0)","v":0},{"$f":"IF(ELEAGUE!N28=ELEAGUE!$C28,3,0)","v":3},{"$f":"IF(ELEAGUE!O28=ELEAGUE!$C28,3,0)","v":3},{"$f":"IF(ELEAGUE!P28=ELEAGUE!$C28,3,0)","v":3},{"$f":"IF(ELEAGUE!Q28=ELEAGUE!$C28,3,0)","v":0},{"$f":"IF(ELEAGUE!R28=ELEAGUE!$C28,3,0)","v":0}]
[null,null,null,{"$f":"IF(ELEAGUE!D29=ELEAGUE!$C29,3,0)","v":3},{"$f":"IF(ELEAGUE!E29=ELEAGUE!$C29,3,0)","v":3},{"$f":"IF(ELEAGUE!F29=ELEAGUE!$C29,3,0)","v":0},{"$f":"IF(ELEAGUE!G29=ELEAGUE!$C29,3,0)","v":0},{"$f":"IF(ELEAGUE!H29=ELEAGUE!$C29,3,0)","v":0},{"$f":"IF(ELEAGUE!I29=ELEAGUE!$C29,3,0)","v":0},{"$f":"IF(ELEAGUE!J29=ELEAGUE!$C29,3,0)","v":0},{"$f":"IF(ELEAGUE!K29=ELEAGUE!$C29,3,0)","v":0},{"$f":"IF(ELEAGUE!L29=ELEAGUE!$C29,3,0)","v":3},{"$f":"IF(ELEAGUE!M29=ELEAGUE!$C29,3,0)","v":0},{"$f":"IF(ELEAGUE!N29=ELEAGUE!$C29,3,0)","v":3},{"$f":"IF(ELEAGUE!O29=ELEAGUE!$C29,3,0)","v":3},{"$f":"IF(ELEAGUE!P29=ELEAGUE!$C29,3,0)","v":0},{"$f":"IF(ELEAGUE!Q29=ELEAGUE!$C29,3,0)","v":3},{"$f":"IF(ELEAGUE!R29=ELEAGUE!$C29,3,0)","v":0}]
[null,null,null,{"$f":"IF(ELEAGUE!D30=ELEAGUE!$C30,3,0)","v":0},{"$f":"IF(ELEAGUE!E30=ELEAGUE!$C30,3,0)","v":3},{"$f":"IF(ELEAGUE!F30=ELEAGUE!$C30,3,0)","v":0},{"$f":"IF(ELEAGUE!G30=ELEAGUE!$C30,3,0)","v":3},{"$f":"IF(ELEAGUE!H30=ELEAGUE!$C30,3,0)","v":3},{"$f":"IF(ELEAGUE!I30=ELEAGUE!$C30,3,0)","v":3},{"$f":"IF(ELEAGUE!J30=ELEAGUE!$C30,3,0)","v":0},{"$f":"IF(ELEAGUE!K30=ELEAGUE!$C30,3,0)","v":0},{"$f":"IF(ELEAGUE!L30=ELEAGUE!$C30,3,0)","v":3},{"$f":"IF(ELEAGUE!M30=ELEAGUE!$C30,3,0)","v":0},{"$f":"IF(ELEAGUE!N30=ELEAGUE!$C30,3,0)","v":0},{"$f":"IF(ELEAGUE!O30=ELEAGUE!$C30,3,0)","v":3},{"$f":"IF(ELEAGUE!P30=ELEAGUE!$C30,3,0)","v":3},{"$f":"IF(ELEAGUE!Q30=ELEAGUE!$C30,3,0)","v":0},{"$f":"IF(ELEAGUE!R30=ELEAGUE!$C30,3,0)","v":0}]
[null,null,null,{"$f":"IF(ELEAGUE!D31=ELEAGUE!$C31,3,0)","v":0},{"$f":"IF(ELEAGUE!E31=ELEAGUE!$C31,3,0)","v":0},{"$f":"IF(ELEAGUE!F31=ELEAGUE!$C31,3,0)","v":0},{"$f":"IF(ELEAGUE!G31=ELEAGUE!$C31,3,0)","v":0},{"$f":"IF(ELEAGUE!H31=ELEAGUE!$C31,3,0)","v":0},{"$f":"IF(ELEAGUE!I31=ELEAGUE!$C31,3,0)","v":0},{"$f":"IF(ELEAGUE!J31=ELEAGUE!$C31,3,0)","v":0},{"$f":"IF(ELEAGUE!K31=ELEAGUE!$C31,3,0)","v":0},{"$f":"IF(ELEAGUE!L31=ELEAGUE!$C31,3,0)","v":0},{"$f":"IF(ELEAGUE!M31=ELEAGUE!$C31,3,0)","v":0},{"$f":"IF(ELEAGUE!N31=ELEAGUE!$C31,3,0)","v":0},{"$f":"IF(ELEAGUE!O31=ELEAGUE!$C31,3,0)","v":0},{"$f":"IF(ELEAGUE!P31=ELEAGUE!$C31,3,0)","v":0},{"$f":"IF(ELEAGUE!Q31=ELEAGUE!$C31,3,0)","v":0},{"$f":"IF(ELEAGUE!R31=ELEAGUE!$C31,3,0)","v":0}]
[null,null,null,{"$f":"IF(ELEAGUE!D32=ELEAGUE!$C32,3,0)","v":0},{"$f":"IF(ELEAGUE!E32=ELEAGUE!$C32,3,0)","v":0},{"$f":"IF(ELEAGUE!F32=ELEAGUE!$C32,3,0)","v":0},{"$f":"IF(ELEAGUE!G32=ELEAGUE!$C32,3,0)","v":0},{"$f":"IF(ELEAGUE!H32=ELEAGUE!$C32,3,0)","v":0},{"$f":"IF(ELEAGUE!I32=ELEAGUE!$C32,3,0)","v":0},{"$f":"IF(ELEAGUE!J32=ELEAGUE!$C32,3,0)","v":0},{"$f":"IF(ELEAGUE!K32=ELEAGUE!$C32,3,0)","v":0},{"$f":"IF(ELEAGUE!L32=ELEAGUE!$C32,3,0)","v":0},{"$f":"IF(ELEAGUE!M32=ELEAGUE!$C32,3,0)","v":0},{"$f":"IF(ELEAGUE!N32=ELEAGUE!$C32,3,0)","v":0},{"$f":"IF(ELEAGUE!O32=ELEAGUE!$C32,3,0)","v":0},{"$f":"IF(ELEAGUE!P32=ELEAGUE!$C32,3,0)","v":0},{"$f":"IF(ELEAGUE!Q32=ELEAGUE!$C32,3,0)","v":0},{"$f":"IF(ELEAGUE!R32=ELEAGUE!$C32,3,0)","v":0}]
["bonus du jour",null,null,{"$f":"IF(ELEAGUE!D33=ELEAGUE!$C33,3,0)","v":0},{"$f":"IF(ELEAGUE!E33=ELEAGUE!$C33,3,0)","v":0},{"$f":"IF(ELEAGUE!F33=ELEAGUE!$C33,3,0)","v":0},{"$f":"IF(ELEAGUE!G33=ELEAGUE!$C33,3,0)","v":0},{"$f":"IF(ELEAGUE!H33=ELEAGUE!$C33,3,0)","v":0},{"$f":"IF(ELEAGUE!I33=ELEAGUE!$C33,3,0)","v":0},{"$f":"IF(ELEAGUE!J33=ELEAGUE!$C33,3,0)","v":0},{"$f":"IF(ELEAGUE!K33=ELEAGUE!$C33,3,0)","v":0},{"$f":"IF(ELEAGUE!L33=ELEAGUE!$C33,3,0)","v":0},{"$f":"IF(ELEAGUE!M33=ELEAGUE!$C33,3,0)","v":0},{"$f":"IF(ELEAGUE!N33=ELEAGUE!$C33,3,0)","v":0},{"$f":"IF(ELEAGUE!O33=ELEAGUE!$C33,3,0)","v":0},{"$f":"IF(ELEAGUE!P33=ELEAGUE!$C33,3,0)","v":0},{"$f":"IF(ELEAGUE!Q33=ELEAGUE!$C33,3,0)","v":0},{"$f":"IF(ELEAGUE!R33=ELEAGUE!$C33,3,0)","v":0}]
[null,"Sous total",null,{"$f":"SUM(D24:D32)","v":15},{"$f":"SUM(E24:E32)","v":12},{"$f":"SUM(F24:F32)","v":9},{"$f":"SUM(G24:G32)","v":6},{"$f":"SUM(H24:H32)","v":6},{"$f":"SUM(I24:I32)","v":12},{"$f":"SUM(J24:J32)","v":0},{"$f":"SUM(K24:K32)","v":9},{"$f":"SUM(L24:L32)","v":15},{"$f":"SUM(M24:M32)","v":0},{"$f":"SUM(N24:N32)","v":15},{"$f":"SUM(O24:O32)","v":12},{"$f":"SUM(P24:P32)","v":12},{"$f":"SUM(Q24:Q32)","v":6},{"$f":"SUM(R24:R32)","v":0}]
["Jour 4",null,null,{"$f":"IF(ELEAGUE!D35=ELEAGUE!$C35,3,0)","v":0},{"$f":"IF(ELEAGUE!E35=ELEAGUE!$C35,3,0)","v":3},{"$f":"IF(ELEAGUE!F35=ELEAGUE!$C35,3,0)","v":0},{"$f":"IF(ELEAGUE!G35=ELEAGUE!$C35,3,0)","v":0},{"$f":"IF(ELEAGUE!H35=ELEAGUE!$C35,3,0)","v":0},{"$f":"IF(ELEAGUE!I35=ELEAGUE!$C35,3,0)","v":0},{"$f":"IF(ELEAGUE!J35=ELEAGUE!$C35,3,0)","v":0},{"$f":"IF(ELEAGUE!K35=ELEAGUE!$C35,3,0)","v":0},{"$f":"IF(ELEAGUE!L35=ELEAGUE!$C35,3,0)","v":0},{"$f":"IF(ELEAGUE!M35=ELEAGUE!$C35,3,0)","v":0},{"$f":"IF(ELEAGUE!N35=ELEAGUE!$C35,3,0)","v":3},{"$f":"IF(ELEAGUE!O35=ELEAGUE!$C35,3,0)","v":3},{"$f":"IF(ELEAGUE!P35=ELEAGUE!$C35,3,0)","v":0},{"$f":"IF(ELEAGUE!Q35=ELEAGUE!$C35,3,0)","v":0},{"$f":"IF(ELEAGUE!R35=ELEAGUE!$C35,3,0)","v":0}]
[null,null,null,{"$f":"IF(ELEAGUE!D36=ELEAGUE!$C36,3,0)","v":0},{"$f":"IF(ELEAGUE!E36=ELEAGUE!$C36,3,0)","v":0},{"$f":"IF(ELEAGUE!F36=ELEAGUE!$C36,3,0)","v":0},{"$f":"IF(ELEAGUE!G36=ELEAGUE!$C36,3,0)","v":0},{"$f":"IF(ELEAGUE!H36=ELEAGUE!$C36,3,0)","v":0},{"$f":"IF(ELEAGUE!I36=ELEAGUE!$C36,3,0)","v":0},{"$f":"IF(ELEAGUE!J36=ELEAGUE!$C36,3,0)","v":0},{"$f":"IF(ELEAGUE!K36=ELEAGUE!$C36,3,0)","v":0},{"$f":"IF(ELEAGUE!L36=ELEAGUE!$C36,3,0)","v":0},{"$f":"IF(ELEAGUE!M36=ELEAGUE!$C36,3,0)","v":0},{"$f":"IF(ELEAGUE!N36=ELEAGUE!$C36,3,0)","v":3},{"$f":"IF(ELEAGUE!O36=ELEAGUE!$C36,3,0)","v":3},{"$f":"IF(ELEAGUE!P36=ELEAGUE!$C36,3,0)","v":3},{"$f":"IF(ELEAGUE!Q36=ELEAGUE!$C36,3,0)","v":0},{"$f":"IF(ELEAGUE!R36=ELEAGUE!$C36,3,0)","v":0}]
[null,null,null,{"$f":"IF(ELEAGUE!D37=ELEAGUE!$C37,3,0)","v":3},{"$f":"IF(ELEAGUE!E37=ELEAGUE!$C37,3,0)","v":0},{"$f":"IF(ELEAGUE!F37=ELEAGUE!$C37,3,0)","v":3},{"$f":"IF(ELEAGUE!G37=ELEAGUE!$C37,3,0)","v":0},{"$f":"IF(ELEAGUE!H37=ELEAGUE!$C37,3,0)","v":0},{"$f":"IF(ELEAGUE!I37=ELEAGUE!$C37,3,0)","v":3},{"$f":"IF(ELEAGUE!J37=ELEAGUE!$C37,3,0)","v":0},{"$f":"IF(ELEAGUE!K37=ELEAGUE!$C37,3,0)","v":3},{"$f":"IF(ELEAGUE!L37=ELEAGUE!$C37,3,0)","v":3},{"$f":"IF(ELEAGUE!M37=ELEAGUE!$C37,3,0)","v":0},{"$f":"IF(ELEAGUE!N37=ELEAGUE!$C37,3,0)","v":0},{"$f":"IF(ELEAGUE!O37=ELEAGUE!$C37,3,0)","v":3},{"$f":"IF(ELEAGUE!P37=ELEAGUE!$C37,3,0)","v":3},{"$f":"IF(ELEAGUE!Q37=ELEAGUE!$C37,3,0)","v":3},{"$f":"IF(ELEAGUE!R37=ELEAGUE!$C37,3,0)","v":0}]
[null,null,null,{"$f":"IF(ELEAGUE!D38=ELEAGUE!$C38,3,0)","v":0},{"$f":"IF(ELEAGUE!E38=ELEAGUE!$C38,3,0)","v":3},{"$f":"IF(ELEAGUE!F38=ELEAGUE!$C38,3,0)","v":3},{"$f":"IF(ELEAGUE!G38=ELEAGUE!$C38,3,0)","v":0},{"$f":"IF(ELEAGUE!H38=ELEAGUE!$C38,3,0)","v":3},{"$f":"IF(ELEAGUE!I38=ELEAGUE!$C38,3,0)","v":0},{"$f":"IF(ELEAGUE!J38=ELEAGUE!$C38,3,0)","v":0},{"$f":"IF(ELEAGUE!K38=ELEAGUE!$C38,3,0)","v":0},{"$f":"IF(ELEAGUE!L38=ELEAGUE!$C38,3,0)","v":0},{"$f":"IF(ELEAGUE!M38=ELEAGUE!$C38,3,0)","v":0},{"$f":"IF(ELEAGUE!N38=ELEAGUE!$C38,3,0)","v":0},{"$f":"IF(ELEAGUE!O38=ELEAGUE!$C38,3,0)","v":0},{"$f":"IF(ELEAGUE!P38=ELEAGUE!$C38,3,0)","v":3},{"$f":"IF(ELEAGUE!Q38=ELEAGUE!$C38,3,0)","v":0},{"$f":"IF(ELEAGUE!R38=ELEAGUE!$C38,3,0)","v":0}]
[null,null,null,{"$f":"IF(ELEAGUE!D39=ELEAGUE!$C39,3,0)","v":0},{"$f":"IF(ELEAGUE!E39=ELEAGUE!$C39,3,0)","v":3},{"$f":"IF(ELEAGUE!F39=ELEAGUE!$C39,3,0)","v":3},{"$f":"IF(ELEAGUE!G39=ELEAGUE!$C39,3,0)","v":0},{"$f":"IF(ELEAGUE!H39=ELEAGUE!$C39,3,0)","v":0},{"$f":"IF(ELEAGUE!I39=ELEAGUE!$C39,3,0)","v":0},{"$f":"IF(ELEAGUE!J39=ELEAGUE!$C39,3,0)","v":0},{"$f":"IF(ELEAGUE!K39=ELEAGUE!$C39,3,0)","v":0},{"$f":"IF(ELEAGUE!L39=ELEAGUE!$C39,3,0)","v":0},{"$f":"IF(ELEAGUE!M39=ELEAGUE!$C39,3,0)","v":0},{"$f":"IF(ELEAGUE!N39=ELEAGUE!$C39,3,0)","v":3},{"$f":"IF(ELEAGUE!O39=ELEAGUE!$C39,3,0)","v":0},{"$f":"IF(ELEAGUE!P39=ELEAGUE!$C39,3,0)","v":3},{"$f":"IF(ELEAGUE!Q39=ELEAGUE!$C39,3,0)","v":0},{"$f":"IF(ELEAGUE!R39=ELEAGUE!$C39,3,0)","v":0}]
[null,null,null,{"$f":"IF(ELEAGUE!D40=ELEAGUE!$C40,3,0)","v":3},{"$f":"IF(ELEAGUE!E40=ELEAGUE!$C40,3,0)","v":0},{"$f":"IF(ELEAGUE!F40=ELEAGUE!$C40,3,0)","v":3},{"$f":"IF(ELEAGUE!G40=ELEAGUE!$C40,3,0)","v":0},{"$f":"IF(ELEAGUE!H40=ELEAGUE!$C40,3,0)","v":0},{"$f":"IF(ELEAGUE!I40=ELEAGUE!$C40,3,0)","v":3},{"$f":"IF(ELEAGUE!J40=ELEAGUE!$C40,3,0)","v":0},{"$f":"IF(ELEAGUE!K40=ELEAGUE!$C40,3,0)","v":3},{"$f":"IF(ELEAGUE!L40=ELEAGUE!$C40,3,0)","v":3},{"$f":"IF(ELEAGUE!M40=ELEAGUE!$C40,3,0)","v":0},{"$f":"IF(ELEAGUE!N40=ELEAGUE!$C40,3,0)","v":3},{"$f":"IF(ELEAGUE!O40=ELEAGUE!$C40,3,0)","v":3},{"$f":"IF(ELEAGUE!P40=ELEAGUE!$C40,3,0)","v":3},{"$f":"IF(ELEAGUE!Q40=ELEAGUE!$C40,3,0)","v":3},{"$f":"IF(ELEAGUE!R40=ELEAGUE!$C40,3,0)","v":0}]
[null,null,null,{"$f":"IF(ELEAGUE!D41=ELEAGUE!$C41,3,0)","v":0},{"$f":"IF(ELEAGUE!E41=ELEAGUE!$C41,3,0)","v":0},{"$f":"IF(ELEAGUE!F41=ELEAGUE!$C41,3,0)","v":0},{"$f":"IF(ELEAGUE!G41=ELEAGUE!$C41,3,0)","v":0},{"$f":"IF(ELEAGUE!H41=ELEAGUE!$C41,3,0)","v":0},{"$f":"IF(ELEAGUE!I41=ELEAGUE!$C41,3,0)","v":0},{"$f":"IF(ELEAGUE!J41=ELEAGUE!$C41,3,0)","v":0},{"$f":"IF(ELEAGUE!K41=ELEAGUE!$C41,3,0)","v":0},{"$f":"IF(ELEAGUE!L41=ELEAGUE!$C41,3,0)","v":0},{"$f":"IF(ELEAGUE!M41=ELEAGUE!$C41,3,0)","v":0},{"$f":"IF(ELEAGUE!N41=ELEAGUE!$C41,3,0)","v":0},{"$f":"IF(ELEAGUE!O41=ELEAGUE!$C41,3,0)","v":0},{"$f":"IF(ELEAGUE!P41=ELEAGUE!$C41,3,0)","v":0},{"$f":"IF(ELEAGUE!Q41=ELEAGUE!$C41,3,0)","v":0},{"$f":"IF(ELEAGUE!R41=ELEAGUE!$C41,3,0)","v":0}]
[null,null,null,{"$f":"IF(ELEAGUE!D42=ELEAGUE!$C42,3,0)","v":0},{"$f":"IF(ELEAGUE!E42=ELEAGUE!$C42,3,0)","v":0},{"$f":"IF(ELEAGUE!F42=ELEAGUE!$C42,3,0)","v":0},{"$f":"IF(ELEAGUE!G42=ELEAGUE!$C42,3,0)","v":0},{"$f":"IF(ELEAGUE!H42=ELEAGUE!$C42,3,0)","v":0},{"$f":"IF(ELEAGUE!I42=ELEAGUE!$C42,3,0)","v":0},{"$f":"IF(ELEAGUE!J42=ELEAGUE!$C42,3,0)","v":0},{"$f":"IF(ELEAGUE!K42=ELEAGUE!$C42,3,0)","v":0},{"$f":"IF(ELEAGUE!L42=ELEAGUE!$C42,3,0)","v":0},{"$f":"IF(ELEAGUE!M42=ELEAGUE!$C42,3,0)","v":0},{"$f":"IF(ELEAGUE!N42=ELEAGUE!$C42,3,0)","v":0},{"$f":"IF(ELEAGUE!O42=ELEAGUE!$C42,3,0)","v":0},{"$f":"IF(ELEAGUE!P42=ELEAGUE!$C42,3,0)","v":0},{"$f":"IF(ELEAGUE!Q42=ELEAGUE!$C42,3,0)","v":0},{"$f":"IF(ELEAGUE!R42=ELEAGUE!$C42,3,0)","v":0}]
["bonus du jour",null,null,{"$f":"IF(ELEAGUE!D43=ELEAGUE!$C43,2,0)","v":0},{"$f":"IF(ELEAGUE!E43=ELEAGUE!$C43,2,0)","v":0},{"$f":"IF(ELEAGUE!F43=ELEAGUE!$C43,2,0)","v":2},{"$f":"IF(ELEAGUE!G43=ELEAGUE!$C43,2,0)","v":0},{"$f":"IF(ELEAGUE!H43=ELEAGUE!$C43,2,0)","v":0},{"$f":"IF(ELEAGUE!I43=ELEAGUE!$C43,2,0)","v":0},{"$f":"IF(ELEAGUE!J43=ELEAGUE!$C43,2,0)","v":0},{"$f":"IF(ELEAGUE!K43=ELEAGUE!$C43,2,0)","v":0},{"$f":"IF(ELEAGUE!L43=ELEAGUE!$C43,2,0)","v":0},{"$f":"IF(ELEAGUE!M43=ELEAGUE!$C43,2,0)","v":0},{"$f":"IF(ELEAGUE!N43=ELEAGUE!$C43,2,0)","v":2},{"$f":"IF(ELEAGUE!O43=ELEAGUE!$C43,2,0)","v":0},{"$f":"IF(ELEAGUE!P43=ELEAGUE!$C43,2,0)","v":0},{"$f":"IF(ELEAGUE!Q43=ELEAGUE!$C43,2,0)","v":0},{"$f":"IF(ELEAGUE!R43=ELEAGUE!$C43,2,0)","v":0}]
[null,"Sous total",null,{"$f":"SUM(D34:D42)","v":6},{"$f":"SUM(E34:E42)","v":9},{"$f":"SUM(F34:F42)","v":14},{"$f":"SUM(G34:G42)","v":0},{"$f":"SUM(H34:H42)","v":3},{"$f":"SUM(I34:I42)","v":6},{"$f":"SUM(J34:J42)","v":0},{"$f":"SUM(K34:K42)","v":6},{"$f":"SUM(L34:L42)","v":6},{"$f":"SUM(M34:M42)","v":0},{"$f":"SUM(N34:N42)","v":14},{"$f":"SUM(O34:O42)","v":12},{"$f":"SUM(P34:P42)","v":15},{"$f":"SUM(Q34:Q42)","v":6},{"$f":"SUM(R34:R42)","v":0}]
[null,null,"Quarts",{"$f":"IF(ELEAGUE!$C57=ELEAGUE!D57,6,IF(OR(LEFT(ELEAGUE!$C57,1)=LEFT(ELEAGUE!D57,1),RIGHT(ELEAGUE!$C57,1)=RIGHT(ELEAGUE!D57,1)),4,0))","v":0},{"$f":"IF(ELEAGUE!$C57=ELEAGUE!E57,6,IF(OR(LEFT(ELEAGUE!$C57,1)=LEFT(ELEAGUE!E57,1),RIGHT(ELEAGUE!$C57,1)=RIGHT(ELEAGUE!E57,1)),4,0))","v":0},{"$f":"IF(ELEAGUE!$C57=ELEAGUE!F57,6,IF(OR(LEFT(ELEAGUE!$C57,1)=LEFT(ELEAGUE!F57,1),RIGHT(ELEAGUE!$C57,1)=RIGHT(ELEAGUE!F57,1)),4,0))","v":0},{"$f":"IF(ELEAGUE!$C57=ELEAGUE!G57,6,IF(OR(LEFT(ELEAGUE!$C57,1)=LEFT(ELEAGUE!G57,1),RIGHT(ELEAGUE!$C57,1)=RIGHT(ELEAGUE!G57,1)),4,0))","v":0},{"$f":"IF(ELEAGUE!$C57=ELEAGUE!H57,6,IF(OR(LEFT(ELEAGUE!$C57,1)=LEFT(ELEAGUE!H57,1),RIGHT(ELEAGUE!$C57,1)=RIGHT(ELEAGUE!H57,1)),4,0))","v":0},{"$f":"IF(ELEAGUE!$C57=ELEAGUE!I57,6,IF(OR(LEFT(ELEAGUE!$C57,1)=LEFT(ELEAGUE!I57,1),RIGHT(ELEAGUE!$C57,1)=RIGHT(ELEAGUE!I57,1)),4,0))","v":0},{"$f":"IF(ELEAGUE!$C57=ELEAGUE!J57,6,IF(OR(LEFT(ELEAGUE!$C57,1)=LEFT(ELEAGUE!J57,1),RIGHT(ELEAGUE!$C57,1)=RIGHT(ELEAGUE!J57,1)),4,0))","v":0},{"$f":"IF(ELEAGUE!$C57=ELEAGUE!K57,6,IF(OR(LEFT(ELEAGUE!$C57,1)=LEFT(ELEAGUE!K57,1),RIGHT(ELEAGUE!$C57,1)=RIGHT(ELEAGUE!K57,1)),4,0))","v":0},{"$f":"IF(ELEAGUE!$C57=ELEAGUE!L57,6,IF(OR(LEFT(ELEAGUE!$C57,1)=LEFT(ELEAGUE!L57,1),RIGHT(ELEAGUE!$C57,1)=RIGHT(ELEAGUE!L57,1)),4,0))","v":0},{"$f":"IF(ELEAGUE!$C57=ELEAGUE!M57,6,IF(OR(LEFT(ELEAGUE!$C57,1)=LEFT(ELEAGUE!M57,1),RIGHT(ELEAGUE!$C57,1)=RIGHT(ELEAGUE!M57,1)),4,0))","v":0},{"$f":"IF(ELEAGUE!$C57=ELEAGUE!N57,6,IF(OR(LEFT(ELEAGUE!$C57,1)=LEFT(ELEAGUE!N57,1),RIGHT(ELEAGUE!$C57,1)=RIGHT(ELEAGUE!N57,1)),4,0))","v":0},{"$f":"IF(ELEAGUE!$C57=ELEAGUE!O57,6,IF(OR(LEFT(ELEAGUE!$C57,1)=LEFT(ELEAGUE!O57,1),RIGHT(ELEAGUE!$C57,1)=RIGHT(ELEAGUE!O57,1)),4,0))","v":6},{"$f":"IF(ELEAGUE!$C57=ELEAGUE!P57,6,IF(OR(LEFT(ELEAGUE!$C57,1)=LEFT(ELEAGUE!P57,1),RIGHT(ELEAGUE!$C57,1)=RIGHT(ELEAGUE!P57,1)),4,0))","v":0},{"$f":"IF(ELEAGUE!$C57=ELEAGUE!Q57,6,IF(OR(LEFT(ELEAGUE!$C57,1)=LEFT(ELEAGUE!Q57,1),RIGHT(ELEAGUE!$C57,1)=RIGHT(ELEAGUE!Q57,1)),4,0))","v":0},{"$f":"IF(ELEAGUE!$C57=ELEAGUE!R57,6,IF(OR(LEFT(ELEAGUE!$C57,1)=LEFT(ELEAGUE!R57,1),RIGHT(ELEAGUE!$C57,1)=RIGHT(ELEAGUE!R57,1)),4,0))","v":0}]
[null,null,null,{"$f":"IF(ELEAGUE!$C58=ELEAGUE!D58,6,IF(OR(LEFT(ELEAGUE!$C58,1)=LEFT(ELEAGUE!D58,1),RIGHT(ELEAGUE!$C58,1)=RIGHT(ELEAGUE!D58,1)),4,0))","v":4},{"$f":"IF(ELEAGUE!$C58=ELEAGUE!E58,6,IF(OR(LEFT(ELEAGUE!$C58,1)=LEFT(ELEAGUE!E58,1),RIGHT(ELEAGUE!$C58,1)=RIGHT(ELEAGUE!E58,1)),4,0))","v":0},{"$f":"IF(ELEAGUE!$C58=ELEAGUE!F58,6,IF(OR(LEFT(ELEAGUE!$C58,1)=LEFT(ELEAGUE!F58,1),RIGHT(ELEAGUE!$C58,1)=RIGHT(ELEAGUE!F58,1)),4,0))","v":0},{"$f":"IF(ELEAGUE!$C58=ELEAGUE!G58,6,IF(OR(LEFT(ELEAGUE!$C58,1)=LEFT(ELEAGUE!G58,1),RIGHT(ELEAGUE!$C58,1)=RIGHT(ELEAGUE!G58,1)),4,0))","v":0},{"$f":"IF(ELEAGUE!$C58=ELEAGUE!H58,6,IF(OR(LEFT(ELEAGUE!$C58,1)=LEFT(ELEAGUE!H58,1),RIGHT(ELEAGUE!$C58,1)=RIGHT(ELEAGUE!H58,1)),4,0))","v":0},{"$f":"IF(ELEAGUE!$C58=ELEAGUE!I58,6,IF(OR(LEFT(ELEAGUE!$C58,1)=LEFT(ELEAGUE!I58,1),RIGHT(ELEAGUE!$C58,1)=RIGHT(ELEAGUE!I58,1)),4,0))","v":0},{"$f":"IF(ELEAGUE!$C58=ELEAGUE!J58,6,IF(OR(LEFT(ELEAGUE!$C58,1)=LEFT(ELEAGUE!J58,1),RIGHT(ELEAGUE!$C58,1)=RIGHT(ELEAGUE!J58,1)),4,0))","v":0},{"$f":"IF(ELEAGUE!$C58=ELEAGUE!K58,6,IF(OR(LEFT(ELEAGUE!$C58,1)=LEFT(ELEAGUE!K58,1),RIGHT(ELEAGUE!$C58,1)=RIGHT(ELEAGUE!K58,1)),4,0))","v":0},{"$f":"IF(ELEAGUE!$C58=ELEAGUE!L58,6,IF(OR(LEFT(ELEAGUE!$C58,1)=LEFT(ELEAGUE!L58,1),RIGHT(ELEAGUE!$C58,1)=RIGHT(ELEAGUE!L58,1)),4,0))","v":0},{"$f":"IF(ELEAGUE!$C58=ELEAGUE!M58,6,IF(OR(LEFT(ELEAGUE!$C58,1)=LEFT(ELEAGUE!M58,1),RIGHT(ELEAGUE!$C58,1)=RIGHT(ELEAGUE!M58,1)),4,0))","v":0},{"$f":"IF(ELEAGUE!$C58=ELEAGUE!N58,6,IF(OR(LEFT(ELEAGUE!$C58,1)=LEFT(ELEAGUE!N58,1),RIGHT(ELEAGUE!$C58,1)=RIGHT(ELEAGUE!N58,1)),4,0))","v":0},{"$f":"IF(ELEAGUE!$C58=ELEAGUE!O58,6,IF(OR(LEFT(ELEAGUE!$C58,1)=LEFT(ELEAGUE!O58,1),RIGHT(ELEAGUE!$C58,1)=RIGHT(ELEAGUE!O58,1)),4,0))","v":6},{"$f":"IF(ELEAGUE!$C58=ELEAGUE!P58,6,IF(OR(LEFT(ELEAGUE!$C58,1)=LEFT(ELEAGUE!P58,1),RIGHT(ELEAGUE!$C58,1)=RIGHT(ELEAGUE!P58,1)),4,0))","v":0},{"$f":"IF(ELEAGUE!$C58=ELEAGUE!Q58,6,IF(OR(LEFT(ELEAGUE!$C58,1)=LEFT(ELEAGUE!Q58,1),RIGHT(ELEAGUE!$C58,1)=RIGHT(ELEAGUE!Q58,1)),4,0))","v":0},{"$f":"IF(ELEAGUE!$C58=ELEAGUE!R58,6,IF(OR(LEFT(ELEAGUE!$C58,1)=LEFT(ELEAGUE!R58,1),RIGHT(ELEAGUE!$C58,1)=RIGHT(ELEAGUE!R58,1)),4,0))","v":0}]
[null,null,null,{"$f":"IF(ELEAGUE!$C59=ELEAGUE!D59,6,IF(OR(LEFT(ELEAGUE!$C59,1)=LEFT(ELEAGUE!D59,1),RIGHT(ELEAGUE!$C59,1)=RIGHT(ELEAGUE!D59,1)),4,0))","v":4},{"$f":"IF(ELEAGUE!$C59=ELEAGUE!E59,6,IF(OR(LEFT(ELEAGUE!$C59,1)=LEFT(ELEAGUE!E59,1),RIGHT(ELEAGUE!$C59,1)=RIGHT(ELEAGUE!E59,1)),4,0))","v":0},{"$f":"IF(ELEAGUE!$C59=ELEAGUE!F59,6,IF(OR(LEFT(ELEAGUE!$C59,1)=LEFT(ELEAGUE!F59,1),RIGHT(ELEAGUE!$C59,1)=RIGHT(ELEAGUE!F59,1)),4,0))","v":4},{"$f":"IF(ELEAGUE!$C59=ELEAGUE!G59,6,IF(OR(LEFT(ELEAGUE!$C59,1)=LEFT(ELEAGUE!G59,1),RIGHT(ELEAGUE!$C59,1)=RIGHT(ELEAGUE!G59,1)),4,0))","v":0},{"$f":"IF(ELEAGUE!$C59=ELEAGUE!H59,6,IF(OR(LEFT(ELEAGUE!$C59,1)=LEFT(ELEAGUE!H59,1),RIGHT(ELEAGUE!$C59,1)=RIGHT(ELEAGUE!H59,1)),4,0))","v":6},{"$f":"IF(ELEAGUE!$C59=ELEAGUE!I59,6,IF(OR(LEFT(ELEAGUE!$C59,1)=LEFT(ELEAGUE!I59,1),RIGHT(ELEAGUE!$C59,1)=RIGHT(ELEAGUE!I59,1)),4,0))","v":4},{"$f":"IF(ELEAGUE!$C59=ELEAGUE!J59,6,IF(OR(LEFT(ELEAGUE!$C59,1)=LEFT(ELEAGUE!J59,1),RIGHT(ELEAGUE!$C59,1)=RIGHT(ELEAGUE!J59,1)),4,0))","v":0},{"$f":"IF(ELEAGUE!$C59=ELEAGUE!K59,6,IF(OR(LEFT(ELEAGUE!$C59,1)=LEFT(ELEAGUE!K59,1),RIGHT(ELEAGUE!$C59,1)=RIGHT(ELEAGUE!K59,1)),4,0))","v":6},{"$f":"IF(ELEAGUE!$C59=ELEAGUE!L59,6,IF(OR(LEFT(ELEAGUE!$C59,1)=LEFT(ELEAGUE!L59,1),RIGHT(ELEAGUE!$C59,1)=RIGHT(ELEAGUE!L59,1)),4,0))","v":4},{"$f":"IF(ELEAGUE!$C59=ELEAGUE!M59,6,IF(OR(LEFT(ELEAGUE!$C59,1)=LEFT(ELEAGUE!M59,1),RIGHT(ELEAGUE!$C59,1)=RIGHT(ELEAGUE!M59,1)),4,0))","v":0},{"$f":"IF(ELEAGUE!$C59=ELEAGUE!N59,6,IF(OR(LEFT(ELEAGUE!$C59,1)=LEFT(ELEAGUE!N59,1),RIGHT(ELEAGUE!$C59,1)=RIGHT(ELEAGUE!N59,1)),4,0))","v":6},{"$f":"IF(ELEAGUE!$C59=ELEAGUE!O59,6,IF(OR(LEFT(ELEAGUE!$C59,1)=LEFT(ELEAGUE!O59,1),RIGHT(ELEAGUE!$C59,1)=RIGHT(ELEAGUE!O59,1)),4,0))","v":6},{"$f":"IF(ELEAGUE!$C59=ELEAGUE!P59,6,IF(OR(LEFT(ELEAGUE!$C59,1)=LEFT(ELEAGUE!P59,1),RIGHT(ELEAGUE!$C59,1)=RIGHT(ELEAGUE!P59,1)),4,0))","v":6},{"$f":"IF(ELEAGUE!$C59=ELEAGUE!Q59,6,IF(OR(LEFT(ELEAGUE!$C59,1)=LEFT(ELEAGUE!Q59,1),RIGHT(ELEAGUE!$C59,1)=RIGHT(ELEAGUE!Q59,1)),4,0))","v":6},{"$f":"IF(ELEAGUE!$C59=ELEAGUE!R59,6,IF(OR(LEFT(ELEAGUE!$C59,1)=LEFT(ELEAGUE!R59,1),RIGHT(ELEAGUE!$C59,1)=RIGHT(ELEAGUE!R59,1)),4,0))","v":0}]
[null,null,null,{"$f":"IF(ELEAGUE!$C60=ELEAGUE!D60,6,IF(OR(LEFT(ELEAGUE!$C60,1)=LEFT(ELEAGUE!D60,1),RIGHT(ELEAGUE!$C60,1)=RIGHT(ELEAGUE!D60,1)),4,0))","v":0},{"$f":"IF(ELEAGUE!$C60=ELEAGUE!E60,6,IF(OR(LEFT(ELEAGUE!$C60,1)=LEFT(ELEAGUE!E60,1),RIGHT(ELEAGUE!$C60,1)=RIGHT(ELEAGUE!E60,1)),4,0))","v":0},{"$f":"IF(ELEAGUE!$C60=ELEAGUE!F60,6,IF(OR(LEFT(ELEAGUE!$C60,1)=LEFT(ELEAGUE!F60,1),RIGHT(ELEAGUE!$C60,1)=RIGHT(ELEAGUE!F60,1)),4,0))","v":4},{"$f":"IF(ELEAGUE!$C60=ELEAGUE!G60,6,IF(OR(LEFT(ELEAGUE!$C60,1)=LEFT(ELEAGUE!G60,1),RIGHT(ELEAGUE!$C60,1)=RIGHT(ELEAGUE!G60,1)),4,0))","v":0},{"$f":"IF(ELEAGUE!$C60=ELEAGUE!H60,6,IF(OR(LEFT(ELEAGUE!$C60,1)=LEFT(ELEAGUE!H60,1),RIGHT(ELEAGUE!$C60,1)=RIGHT(ELEAGUE!H60,1)),4,0))","v":0},{"$f":"IF(ELEAGUE!$C60=ELEAGUE!I60,6,IF(OR(LEFT(ELEAGUE!$C60,1)=LEFT(ELEAGUE!I60,1),RIGHT(ELEAGUE!$C60,1)=RIGHT(ELEAGUE!I60,1)),4,0))","v":0},{"$f":"IF(ELEAGUE!$C60=ELEAGUE!J60,6,IF(OR(LEFT(ELEAGUE!$C60,1)=LEFT(ELEAGUE!J60,1),RIGHT(ELEAGUE!$C60,1)=RIGHT(ELEAGUE!J60,1)),4,0))","v":0},{"$f":"IF(ELEAGUE!$C60=ELEAGUE!K60,6,IF(OR(LEFT(ELEAGUE!$C60,1)=LEFT(ELEAGUE!K60,1),RIGHT(ELEAGUE!$C60,1)=RIGHT(ELEAGUE!K60,1)),4,0))","v":6},{"$f":"IF(ELEAGUE!$C60=ELEAGUE!L60,6,IF(OR(LEFT(ELEAGUE!$C60,1)=LEFT(ELEAGUE!L60,1),RIGHT(ELEAGUE!$C60,1)=RIGHT(ELEAGUE!L60,1)),4,0))","v":0},{"$f":"IF(ELEAGUE!$C60=ELEAGUE!M60,6,IF(OR(LEFT(ELEAGUE!$C60,1)=LEFT(ELEAGUE!M60,1),RIGHT(ELEAGUE!$C60,1)=RIGHT(ELEAGUE!M60,1)),4,0))","v":0},{"$f":"IF(ELEAGUE!$C60=ELEAGUE!N60,6,IF(OR(LEFT(ELEAGUE!$C60,1)=LEFT(ELEAGUE!N60,1),RIGHT(ELEAGUE!$C60,1)=RIGHT(ELEAGUE!N60,1)),4,0))","v":6},{"$f":"IF(ELEAGUE!$C60=ELEAGUE!O60,6,IF(OR(LEFT(ELEAGUE!$C60,1)=LEFT(ELEAGUE!O60,1),RIGHT(ELEAGUE!$C60,1)=RIGHT(ELEAGUE!O60,1)),4,0))","v":0},{"$f":"IF(ELEAGUE!$C60=ELEAGUE!P60,6,IF(OR(LEFT(ELEAGUE!$C60,1)=LEFT(ELEAGUE!P60,1),RIGHT(ELEAGUE!$C60,1)=RIGHT(ELEAGUE!P60,1)),4,0))","v":4},{"$f":"IF(ELEAGUE!$C60=ELEAGUE!Q60,6,IF(OR(LEFT(ELEAGUE!$C60,1)=LEFT(ELEAGUE!Q60,1),RIGHT(ELEAGUE!$C60,1)=RIGHT(ELEAGUE!Q60,1)),4,0))","v":6},{"$f":"IF(ELEAGUE!$C60=ELEAGUE!R60,6,IF(OR(LEFT(ELEAGUE!$C60,1)=LEFT(ELEAGUE!R60,1),RIGHT(ELEAGUE!$C60,1)=RIGHT(ELEAGUE!R60,1)),4,0))","v":0}]
[null,null,"Demies",{"$f":"IF(ELEAGUE!$C65=ELEAGUE!D65,7,IF(OR(LEFT(ELEAGUE!$C65,1)=LEFT(ELEAGUE!D65,1),RIGHT(ELEAGUE!$C65,1)=RIGHT(ELEAGUE!D65,1)),5,0))","v":0},{"$f":"IF(ELEAGUE!$C65=ELEAGUE!E65,7,IF(OR(LEFT(ELEAGUE!$C65,1)=LEFT(ELEAGUE!E65,1),RIGHT(ELEAGUE!$C65,1)=RIGHT(ELEAGUE!E65,1)),5,0))","v":7},{"$f":"IF(ELEAGUE!$C65=ELEAGUE!F65,7,IF(OR(LEFT(ELEAGUE!$C65,1)=LEFT(ELEAGUE!F65,1),RIGHT(ELEAGUE!$C65,1)=RIGHT(ELEAGUE!F65,1)),5,0))","v":0},{"$f":"IF(ELEAGUE!$C65=ELEAGUE!G65,7,IF(OR(LEFT(ELEAGUE!$C65,1)=LEFT(ELEAGUE!G65,1),RIGHT(ELEAGUE!$C65,1)=RIGHT(ELEAGUE!G65,1)),5,0))","v":7},{"$f":"IF(ELEAGUE!$C65=ELEAGUE!H65,7,IF(OR(LEFT(ELEAGUE!$C65,1)=LEFT(ELEAGUE!H65,1),RIGHT(ELEAGUE!$C65,1)=RIGHT(ELEAGUE!H65,1)),5,0))","v":0},{"$f":"IF(ELEAGUE!$C65=ELEAGUE!I65,7,IF(OR(LEFT(ELEAGUE!$C65,1)=LEFT(ELEAGUE!I65,1),RIGHT(ELEAGUE!$C65,1)=RIGHT(ELEAGUE!I65,1)),5,0))","v":0},{"$f":"IF(ELEAGUE!$C65=ELEAGUE!J65,7,IF(OR(LEFT(ELEAGUE!$C65,1)=LEFT(ELEAGUE!J65,1),RIGHT(ELEAGUE!$C65,1)=RIGHT(ELEAGUE!J65,1)),5,0))","v":7},{"$f":"IF(ELEAGUE!$C65=ELEAGUE!K65,7,IF(OR(LEFT(ELEAGUE!$C65,1)=LEFT(ELEAGUE!K65,1),RIGHT(ELEAGUE!$C65,1)=RIGHT(ELEAGUE!K65,1)),5,0))","v":0},{"$f":"IF(ELEAGUE!$C65=ELEAGUE!L65,7,IF(OR(LEFT(ELEAGUE!$C65,1)=LEFT(ELEAGUE!L65,1),RIGHT(ELEAGUE!$C65,1)=RIGHT(ELEAGUE!L65,1)),5,0))","v":0},{"$f":"IF(ELEAGUE!$C65=ELEAGUE!M65,7,IF(OR(LEFT(ELEAGUE!$C65,1)=LEFT(ELEAGUE!M65,1),RIGHT(ELEAGUE!$C65,1)=RIGHT(ELEAGUE!M65,1)),5,0))","v":7},{"$f":"IF(ELEAGUE!$C65=ELEAGUE!N65,7,IF(OR(LEFT(ELEAGUE!$C65,1)=LEFT(ELEAGUE!N65,1),RIGHT(ELEAGUE!$C65,1)=RIGHT(ELEAGUE!N65,1)),5,0))","v":0},{"$f":"IF(ELEAGUE!$C65=ELEAGUE!O65,7,IF(OR(LEFT(ELEAGUE!$C65,1)=LEFT(ELEAGUE!O65,1),RIGHT(ELEAGUE!$C65,1)=RIGHT(ELEAGUE!O65,1)),5,0))","v":0},{"$f":"IF(ELEAGUE!$C65=ELEAGUE!P65,7,IF(OR(LEFT(ELEAGUE!$C65,1)=LEFT(ELEAGUE!P65,1),RIGHT(ELEAGUE!$C65,1)=RIGHT(ELEAGUE!P65,1)),5,0))","v":0},{"$f":"IF(ELEAGUE!$C65=ELEAGUE!Q65,7,IF(OR(LEFT(ELEAGUE!$C65,1)=LEFT(ELEAGUE!Q65,1),RIGHT(ELEAGUE!$C65,1)=RIGHT(ELEAGUE!Q65,1)),5,0))","v":0},{"$f":"IF(ELEAGUE!$C65=ELEAGUE!R65,7,IF(OR(LEFT(ELEAGUE!$C65,1)=LEFT(ELEAGUE!R65,1),RIGHT(ELEAGUE!$C65,1)=RIGHT(ELEAGUE!R65,1)),5,0))","v":7}]
[null,null,null,{"$f":"IF(ELEAGUE!$C81=ELEAGUE!D81,7,IF(OR(LEFT(ELEAGUE!$C81,1)=LEFT(ELEAGUE!D81,1),RIGHT(ELEAGUE!$C81,1)=RIGHT(ELEAGUE!D81,1)),5,0))","v":7},{"$f":"IF(ELEAGUE!$C81=ELEAGUE!E81,7,IF(OR(LEFT(ELEAGUE!$C81,1)=LEFT(ELEAGUE!E81,1),RIGHT(ELEAGUE!$C81,1)=RIGHT(ELEAGUE!E81,1)),5,0))","v":7},{"$f":"IF(ELEAGUE!$C81=ELEAGUE!F81,7,IF(OR(LEFT(ELEAGUE!$C81,1)=LEFT(ELEAGUE!F81,1),RIGHT(ELEAGUE!$C81,1)=RIGHT(ELEAGUE!F81,1)),5,0))","v":7},{"$f":"IF(ELEAGUE!$C81=ELEAGUE!G81,7,IF(OR(LEFT(ELEAGUE!$C81,1)=LEFT(ELEAGUE!G81,1),RIGHT(ELEAGUE!$C81,1)=RIGHT(ELEAGUE!G81,1)),5,0))","v":7},{"$f":"IF(ELEAGUE!$C81=ELEAGUE!H81,7,IF(OR(LEFT(ELEAGUE!$C81,1)=LEFT(ELEAGUE!H81,1),RIGHT(ELEAGUE!$C81,1)=RIGHT(ELEAGUE!H81,1)),5,0))","v":7},{"$f":"IF(ELEAGUE!$C81=ELEAGUE!I81,7,IF(OR(LEFT(ELEAGUE!$C81,1)=LEFT(ELEAGUE!I81,1),RIGHT(ELEAGUE!$C81,1)=RIGHT(ELEAGUE!I81,1)),5,0))","v":7},{"$f":"IF(ELEAGUE!$C81=ELEAGUE!J81,7,IF(OR(LEFT(ELEAGUE!$C81,1)=LEFT(ELEAGUE!J81,1),RIGHT(ELEAGUE!$C81,1)=RIGHT(ELEAGUE!J81,1)),5,0))","v":7},{"$f":"IF(ELEAGUE!$C81=ELEAGUE!K81,7,IF(OR(LEFT(ELEAGUE!$C81,1)=LEFT(ELEAGUE!K81,1),RIGHT(ELEAGUE!$C81,1)=RIGHT(ELEAGUE!K81,1)),5,0))","v":7},{"$f":"IF(ELEAGUE!$C81=ELEAGUE!L81,7,IF(OR(LEFT(ELEAGUE!$C81,1)=LEFT(ELEAGUE!L81,1),RIGHT(ELEAGUE!$C81,1)=RIGHT(ELEAGUE!L81,1)),5,0))","v":7},{"$f":"IF(ELEAGUE!$C81=ELEAGUE!M81,7,IF(OR(LEFT(ELEAGUE!$C81,1)=LEFT(ELEAGUE!M81,1),RIGHT(ELEAGUE!$C81,1)=RIGHT(ELEAGUE!M81,1)),5,0))","v":7},{"$f":"IF(ELEAGUE!$C81=ELEAGUE!N81,7,IF(OR(LEFT(ELEAGUE!$C81,1)=LEFT(ELEAGUE!N81,1),RIGHT(ELEAGUE!$C81,1)=RIGHT(ELEAGUE!N81,1)),5,0))","v":7},{"$f":"IF(ELEAGUE!$C81=ELEAGUE!O81,7,IF(OR(LEFT(ELEAGUE!$C81,1)=LEFT(ELEAGUE!O81,1),RIGHT(ELEAGUE!$C81,1)=RIGHT(ELEAGUE!O81,1)),5,0))","v":7},{"$f":"IF(ELEAGUE!$C81=ELEAGUE!P81,7,IF(OR(LEFT(ELEAGUE!$C81,1)=LEFT(ELEAGUE!P81,1),RIGHT(ELEAGUE!$C81,1)=RIGHT(ELEAGUE!P81,1)),5,0))","v":7},{"$f":"IF(ELEAGUE!$C81=ELEAGUE!Q81,7,IF(OR(LEFT(ELEAGUE!$C81,1)=LEFT(ELEAGUE!Q81,1),RIGHT(ELEAGUE!$C81,1)=RIGHT(ELEAGUE!Q81,1)),5,0))","v":7},{"$f":"IF(ELEAGUE!$C81=ELEAGUE!R81,7,IF(OR(LEFT(ELEAGUE!$C81,1)=LEFT(ELEAGUE!R81,1),RIGHT(ELEAGUE!$C81,1)=RIGHT(ELEAGUE!R81,1)),5,0))","v":7}]
[null,null,"Finale",{"$f":"IF(ELEAGUE!$C82=ELEAGUE!D82,9,IF(OR(LEFT(ELEAGUE!$C82,1)=LEFT(ELEAGUE!D82,1),RIGHT(ELEAGUE!$C82,1)=RIGHT(ELEAGUE!D82,1)),6,0))","v":0},{"$f":"IF(ELEAGUE!$C82=ELEAGUE!E82,9,IF(OR(LEFT(ELEAGUE!$C82,1)=LEFT(ELEAGUE!E82,1),RIGHT(ELEAGUE!$C82,1)=RIGHT(ELEAGUE!E82,1)),6,0))","v":0},{"$f":"IF(ELEAGUE!$C82=ELEAGUE!F82,9,IF(OR(LEFT(ELEAGUE!$C82,1)=LEFT(ELEAGUE!F82,1),RIGHT(ELEAGUE!$C82,1)=RIGHT(ELEAGUE!F82,1)),6,0))","v":0},{"$f":"IF(ELEAGUE!$C82=ELEAGUE!G82,9,IF(OR(LEFT(ELEAGUE!$C82,1)=LEFT(ELEAGUE!G82,1),RIGHT(ELEAGUE!$C82,1)=RIGHT(ELEAGUE!G82,1)),6,0))","v":0},{"$f":"IF(ELEAGUE!$C82=ELEAGUE!H82,9,IF(OR(LEFT(ELEAGUE!$C82,1)=LEFT(ELEAGUE!H82,1),RIGHT(ELEAGUE!$C82,1)=RIGHT(ELEAGUE!H82,1)),6,0))","v":0},{"$f":"IF(ELEAGUE!$C82=ELEAGUE!I82,9,IF(OR(LEFT(ELEAGUE!$C82,1)=LEFT(ELEAGUE!I82,1),RIGHT(ELEAGUE!$C82,1)=RIGHT(ELEAGUE!I82,1)),6,0))","v":0},{"$f":"IF(ELEAGUE!$C82=ELEAGUE!J82,9,IF(OR(LEFT(ELEAGUE!$C82,1)=LEFT(ELEAGUE!J82,1),RIGHT(ELEAGUE!$C82,1)=RIGHT(ELEAGUE!J82,1)),6,0))","v":0},{"$f":"IF(ELEAGUE!$C82=ELEAGUE!K82,9,IF(OR(LEFT(ELEAGUE!$C82,1)=LEFT(ELEAGUE!K82,1),RIGHT(ELEAGUE!$C82,1)=RIGHT(ELEAGUE!K82,1)),6,0))","v":0},{"$f":"IF(ELEAGUE!$C82=ELEAGUE!L82,9,IF(OR(LEFT(ELEAGUE!$C82,1)=LEFT(ELEAGUE!L82,1),RIGHT(ELEAGUE!$C82,1)=RIGHT(ELEAGUE!L82,1)),6,0))","v":0},{"$f":"IF(ELEAGUE!$C82=ELEAGUE!M82,9,IF(OR(LEFT(ELEAGUE!$C82,1)=LEFT(ELEAGUE!M82,1),RIGHT(ELEAGUE!$C82,1)=RIGHT(ELEAGUE!M82,1)),6,0))","v":0},{"$f":"IF(ELEAGUE!$C82=ELEAGUE!N82,9,IF(OR(LEFT(ELEAGUE!$C82,1)=LEFT(ELEAGUE!N82,1),RIGHT(ELEAGUE!$C82,1)=RIGHT(ELEAGUE!N82,1)),6,0))","v":0},{"$f":"IF(ELEAGUE!$C82=ELEAGUE!O82,9,IF(OR(LEFT(ELEAGUE!$C82,1)=LEFT(ELEAGUE!O82,1),RIGHT(ELEAGUE!$C82,1)=RIGHT(ELEAGUE!O82,1)),6,0))","v":0},{"$f":"IF(ELEAGUE!$C82=ELEAGUE!P82,9,IF(OR(LEFT(ELEAGUE!$C82,1)=LEFT(ELEAGUE!P82,1),RIGHT(ELEAGUE!$C82,1)=RIGHT(ELEAGUE!P82,1)),6,0))","v":0},{"$f":"IF(ELEAGUE!$C82=ELEAGUE!Q82,9,IF(OR(LEFT(ELEAGUE!$C82,1)=LEFT(ELEAGUE!Q82,1),RIGHT(ELEAGUE!$C82,1)=RIGHT(ELEAGUE!Q82,1)),6,0))","v":0},{"$f":"IF(ELEAGUE!$C82=ELEAGUE!R82,9,IF(OR(LEFT(ELEAGUE!$C82,1)=LEFT(ELEAGUE!R82,1),RIGHT(ELEAGUE!$C82,1)=RIGHT(ELEAGUE!R82,1)),6,0))","v":9}]
[]
[]
[]
[]
[]
[null,"Total groupes",null,{"$f":"D13+D23+D33+D43+D53","v":51},{"$f":"E13+E23+E33+E43+E53","v":45},50,42,51,57,15,51,54,18,59,57,66,48,0]